{"text_format":"1","workbook":"xlsx","n_sheets":12,"sheets":["ANLAGENVERZEICHNISSE","BUCHUNGSSÄTZE","BUCHFÜHRUNG","Ber.BILAN","Ber.RENT","Ber.FIN","Ber.STAB","Korrektur","Hilfe.BILAN","Hilfe.RENT","Hilfe.FIN","Hilfe.STAB"],"not_rendered":{"charts":0,"images":108,"macros":1,"external_links":0,"defined_names":21,"comments":0,"pivot_tables":0},"unopened":[],"bounds":{"document_bytes":16777216,"sheet_cells":100000,"rows_first":2000,"rows_last":500,"rows_between":2000,"halvings":0,"cell_chars":16384,"cell_head_chars":4096},"cells_cut":0,"cells_raw":0,"read":"whole","date_system":"1900"}

{"sheet":"ANLAGENVERZEICHNISSE","index":0,"n_rows":30,"n_cols":78,"rows_kept":30,"cut":false,"hidden":false,"merged":[]}
[null,null,"Anlageverzeichnisse",null,null,null,null,null,"Gruppe: ",1]
[]
[null,null,"Berechnung der Abschreibung"]
[null,null,"Berechnung der Buchwerte am Beginn und am Ende des Jahres"]
[]
[null,null,"Anlageverzeichnis Gebäude",null,null,null,null,null,null,null,null,null,null,null,null,null,1,2,3,4,5,6,7,8,9,10,11,12,13,14,15,16,17,18,19,20,21,22,23,24,25,26,27,28,29,30,null,null,1,2,3,4,5,6,7,8,9,10,11,12,13,14,15,16,17,18,19,20,21,22,23,24,25,26,27,28,29,30]
[null,null,"Bezeichnung","Anschaf-\nfung","Anschaf-fungs-kosten","Nutz-\nungs-dauer","Abschrei-bung pro Jahr","AfA bis 31.12.xx","Wert am 1.01.xx","Wert am 31.12.xx",null,null,null,"Alter",null,null,"Haupt-\nvariante",-0.1,0.02,0.06,-0.03,-0.04,0.22,-0.15,0.08,0.03,-0.02,0.19,7.0000000000000007E-2,0.05,-0.16,-0.06,0.12,-0.05,0.06,0.08,0.04,-0.2,-7.0000000000000007E-2,0.09,0.15,-0.18,-0.11,0.17,-0.1,-0.06,null,null,"Haupt-\nvariante",{"$f":"R7","v":-0.1},{"$f":"S7","v":0.02},0.06,-0.03,-0.04,0.22,-0.15,0.08,0.03,-0.02,0.19,7.0000000000000007E-2,0.05,-0.16,-0.06,0.12,-0.05,0.06,0.08,0.04,-0.2,-7.0000000000000007E-2,0.09,0.15,-0.18,-0.11,0.17,-0.1,-0.06]
[null,null,"Rinderstall","01.05.xxxx",{"$f":"IF(TYPE(VLOOKUP($C8,$P$6:$AT$28,$J$1+1,0))=16,\"\",VLOOKUP($C8,$P$6:$AT$28,$J$1+1,0))","v":155000},{"$f":"IF(TYPE(VLOOKUP($C8,$AV$6:$BZ$28,$J$1+1,0))=16,\"\",VLOOKUP($C8,$AV$6:$BZ$28,$J$1+1,0))","v":25},{"$f":"IF(OR(E8=\"\",F8=\"\"),\"\",IF(N8>=F8,0,E8/F8))","v":6200},{"$f":"IF((E8/F8)*N8=0,0,IF((E8/F8)*N8>E8,E8,(E8/F8)*N8))","v":62000},{"$f":"IF(N8=0,0,IF(OR(E8=\"\",H8=\"\"),\"\",E8-H8))","v":93000},{"$f":"IF(N8=0,E8-G8,IF(OR(G8=\"\",I8=\"\"),\"\",+I8-G8))","v":86800},null,null,null,{"$f":"F8-15","v":10},null,{"$f":"IF(C8=\"\",\"\",C8)","v":"Rinderstall"},155000,{"$f":"MROUND($Q8+$Q8*R$7,$F8)","v":139500},158100,164300,150350,148800,189100,131750,167400,159650,151900,184450,165850,162750,130200,145700,173600,147250,164300,167400,161200,124000,144150,168950,178250,127100,137950,181350,139500,145700,null,{"$f":"IF(C8=\"\",\"\",C8)","v":"Rinderstall"},25,{"$f":"EVEN($AW8+$AW8*AX$7)","v":24},26,28,26,24,32,22,28,26,26,30,28,28,22,24,28,24,28,28,26,20,24,28,30,22,24,30,24,24]
[null,null,"Futterlager","23.04.xxxx",{"$f":"IF(TYPE(VLOOKUP($C9,$P$6:$AT$28,$J$1+1,0))=16,\"\",VLOOKUP($C9,$P$6:$AT$28,$J$1+1,0))","v":25000},{"$f":"IF(TYPE(VLOOKUP($C9,$AV$6:$BZ$28,$J$1+1,0))=16,\"\",VLOOKUP($C9,$AV$6:$BZ$28,$J$1+1,0))","v":20},1250,7500,17500,16250,null,null,null,{"$f":"F9-14","v":6},null,{"$f":"IF(C9=\"\",\"\",C9)","v":"Futterlager"},25000,{"$f":"MROUND($Q9+$Q9*R$7,$F9)","v":22500},{"$f":"MROUND($Q9+$Q9*S$7,$F9)","v":25500},26500,24260,24000,30500,21260,27000,25760,24500,29760,{"$f":"MROUND($Q9+$Q9*AC$7,$F9)","v":26760},26260,21000,23500,28000,23760,26500,27000,26000,20000,{"$f":"MROUND($Q9+$Q9*AM$7,$F9)","v":23260},27260,28760,20500,22260,29260,22500,23500,null,{"$f":"IF(C9=\"\",\"\",C9)","v":"Futterlager"},20,{"$f":"EVEN($AW9+$AW9*AX$7)","v":18},22,22,20,20,26,18,22,22,20,24,22,22,18,20,24,20,22,22,22,16,20,22,24,18,18,24,18,20]
[null,null,"Güllegrube","17.04.xxxx",{"$f":"IF(TYPE(VLOOKUP($C10,$P$6:$AT$28,$J$1+1,0))=16,\"\",VLOOKUP($C10,$P$6:$AT$28,$J$1+1,0))","v":16000},{"$f":"IF(TYPE(VLOOKUP($C10,$AV$6:$BZ$28,$J$1+1,0))=16,\"\",VLOOKUP($C10,$AV$6:$BZ$28,$J$1+1,0))","v":20},800,12800,3200,2400,null,null,null,{"$f":"F10-4","v":16},null,"Güllegrube",16000,14400,16320,16960,15520,15360,19520,13600,17280,16480,15680,19040,17120,16800,13440,15040,17920,15200,16960,17280,16640,12800,14880,17440,18400,13120,14240,18720,14400,15040,null,{"$f":"IF(C10=\"\",\"\",C10)","v":"Güllegrube"},20,18,22,22,20,20,26,18,22,22,20,24,22,22,18,20,24,20,22,22,22,16,20,22,24,18,18,24,18,20]
[null,null,"Ferienwohnung","12.05.xxxx",{"$f":"IF(TYPE(VLOOKUP($C11,$P$6:$AT$28,$J$1+1,0))=16,\"\",VLOOKUP($C11,$P$6:$AT$28,$J$1+1,0))","v":36500},{"$f":"IF(TYPE(VLOOKUP($C11,$AV$6:$BZ$28,$J$1+1,0))=16,\"\",VLOOKUP($C11,$AV$6:$BZ$28,$J$1+1,0))","v":15},2433.3333333333335,17033.333333333336,19466.666666666664,17033.333333333332,null,null,null,{"$f":"F11-8","v":7},null,"Ferienwohnung",36500,32850,37230,38685,35400,35040,44535,31020,39420,37590,35775,43440,39060,38325,30660,34305,40875,34680,38685,39420,37965,29205,33945,39780,41970,29925,32490,42705,32850,34305,null,{"$f":"IF(C11=\"\",\"\",C11)","v":"Ferienwohnung"},15,14,16,16,16,16,20,14,18,16,16,18,18,16,14,16,18,16,16,18,16,12,14,18,18,14,14,18,14,16]
[null,null,"Maschinenhalle","30.03.xxxx",{"$f":"IF(TYPE(VLOOKUP($C12,$P$6:$AT$28,$J$1+1,0))=16,\"\",VLOOKUP($C12,$P$6:$AT$28,$J$1+1,0))","v":18500},{"$f":"IF(TYPE(VLOOKUP($C12,$AV$6:$BZ$28,$J$1+1,0))=16,\"\",VLOOKUP($C12,$AV$6:$BZ$28,$J$1+1,0))","v":30},616.66666666666663,17266.666666666664,1233.3333333333358,616.66666666666913,null,null,null,{"$f":"F12-2","v":28},null,"Maschinenhalle",18500,16650,18870,19620,17940,17760,22560,15720,19980,19050,18120,22020,19800,19440,15540,17400,20730,17580,19620,19980,19230,14790,17220,20160,21270,15180,16470,21660,16650,17400,null,{"$f":"IF(C12=\"\",\"\",C12)","v":"Maschinenhalle"},30,28,32,32,30,30,38,26,34,32,30,36,34,32,26,30,34,30,32,34,32,24,28,34,36,26,28,36,28,30]
[null,null,"Abschreibung ",null,{"$f":"SUM(E8:E12)","v":251000},null,{"$f":"SUM(G8:G12)","v":11300}]
[null,null,"Buchwerte",null,null,null,null,null,{"$f":"SUM(I8:I12)","v":134400},{"$f":"SUM(J8:J12)","v":123100}]
[]
[null,null,"Anlageverzeichnis Maschinen und Geräte",null,null,null,null,null,null,null,null,null,null,null,null,null,1,2,3,4,5,6,7,8,9,10,11,12,13,14,15,16,17,18,19,20,21,22,23,24,25,26,27,28,29,30,null,null,1,2,3,4,5,6,7,8,9,10,11,12,13,14,15,16,17,18,19,20,21,22,23,24,25,26,27,28,29,30]
[null,null,"Bezeichnung","Anschaf-\nfung","Anschaf-fungs-kosten","Nutz-\nungs-dauer","Abschrei-bung pro Jahr","AfA bis 31.12.xx","Wert am 1.01.xx","Wert am 31.12.xx",null,null,null,"Alter",null,null,"Haupt-\nvariante",{"$f":"R7","v":-0.1},{"$f":"S7","v":0.02},0.06,-0.03,-0.04,0.22,-0.15,0.08,0.03,-0.02,0.19,7.0000000000000007E-2,0.05,-0.16,-0.06,0.12,-0.05,0.06,0.08,0.04,-0.2,-7.0000000000000007E-2,0.09,0.15,-0.18,-0.11,0.17,-0.1,-0.06,null,null,"Haupt-\nvariante",{"$f":"AX7","v":-0.1},{"$f":"AY7","v":0.02},0.06,-0.03,-0.04,0.22,-0.15,0.08,0.03,-0.02,0.19,7.0000000000000007E-2,0.05,-0.16,-0.06,0.12,-0.05,0.06,0.08,0.04,-0.2,-7.0000000000000007E-2,0.09,0.15,-0.18,-0.11,0.17,-0.1,-0.06]
[null,null,"Allradtraktor","21.10.xxxx",{"$f":"IF(TYPE(VLOOKUP($C18,$P$6:$AT$28,$J$1+1,0))=16,\"\",VLOOKUP($C18,$P$6:$AT$28,$J$1+1,0))","v":66006},{"$f":"IF(TYPE(VLOOKUP($C18,$AV$6:$BZ$28,$J$1+1,0))=16,\"\",VLOOKUP($C18,$AV$6:$BZ$28,$J$1+1,0))","v":18},{"$f":"IF(OR(E18=\"\",F18=\"\"),\"\",IF(N18>=F18,0,E18/F18))","v":3667},{"$f":"IF((E18/F18)*N18=0,0,IF((E18/F18)*N18>E18,E18,(E18/F18)*N18))","v":3667},{"$f":"IF(N18=0,0,IF(OR(E18=\"\",H18=\"\"),\"\",E18-H18))","v":62339},{"$f":"IF(N18=0,E18-G18,IF(OR(G18=\"\",I18=\"\"),\"\",+I18-G18))","v":58672},null,null,null,1,null,"Allradtraktor",66006,{"$f":"MROUND($Q18+$Q18*R$7,$F18)","v":59400},67320,69966,64026,63360,80532,56106,71280,67986,64692,{"$f":"MROUND($Q18+$Q18*AB$7,$F18)","v":78552},70632,69300,55440,62046,73926,62712,69966,71280,68652,{"$f":"MROUND($Q18+$Q18*AL$7,$F18)","v":52812},61380,71946,75906,54126,58752,77220,59400,62046,null,{"$f":"IF(C18=\"\",\"\",C18)","v":"Allradtraktor"},18,{"$f":"EVEN($AW18+$AW18*AX$7)","v":18},20,20,18,18,22,16,20,20,18,22,20,20,16,18,22,{"$f":"EVEN($AW18+$AW18*BN$7)","v":18},20,20,20,16,18,20,22,16,18,22,18,18]
[null,null,"Hinterradtraktor","11.02.xxxx",45200,15,{"$f":"IF(OR(E19=\"\",F19=\"\"),\"\",IF(N19>=F19,0,E19/F19))","v":0},{"$f":"IF((E19/F19)*N19=0,0,IF((E19/F19)*N19>E19,E19,(E19/F19)*N19))","v":45200},{"$f":"IF(N19=0,0,IF(OR(E19=\"\",H19=\"\"),\"\",E19-H19))","v":0},{"$f":"IF(N19=0,E19-G19,IF(OR(G19=\"\",I19=\"\"),\"\",+I19-G19))","v":0},null,null,null,{"$f":"F19","v":15},null,"Hinterradtraktor",45200,40680,46110,47910,43845,43395,55140,38415,48810,46560,44295,53790,48360,47460,37965,42495,50625,42945,47910,48810,47010,36165,42030,49275,51975,37065,40230,52890,40680,42495,null,"Hinterradtraktor",15,14,16,16,16,16,20,14,18,16,16,18,18,16,14,16,18,16,16,18,16,12,14,18,18,14,14,18,14,16]
[null,null,"Pflug","07.04.xxxx",7580,20,0,7580,0,0,null,null,null,{"$f":"F20","v":20},null,"Pflug",7580,6820,7740,8040,7360,7280,9240,6440,8180,7800,7420,9020,8120,7960,6360,7120,8480,7200,8040,8180,7880,6060,7040,8260,8720,6220,6740,8860,6820,7120,null,"Pflug",20,18,22,22,20,20,26,18,22,22,20,24,22,22,18,20,24,20,22,22,22,16,20,22,24,18,18,24,18,20]
[null,null,"Saatbettkombination","11.05.xxxx",5600,20,280,560,5040,4760,null,null,null,2,null,"Saatbettkombination",5600,5040,5720,5940,5440,5380,6840,4760,6040,5760,5480,6660,6000,5880,4700,5260,6280,5320,5940,6040,5820,4480,5200,6100,6440,4600,4980,6560,5040,5260,null,"Saatbettkombination",20,18,22,22,20,20,26,18,22,22,20,24,22,22,18,20,24,20,22,22,22,16,20,22,24,18,18,24,18,20]
[null,null,"Sämaschine","31.03.xxxx",8660,20,433,433,8227,7794,null,null,null,1,null,"Sämaschine",8660,7800,8840,9180,8400,8320,10560,7360,9360,8920,8480,10300,9260,9100,7280,8140,9700,8220,9180,9360,9000,6920,8060,9440,9960,7100,7700,10140,7800,8140,null,"Sämaschine",20,18,22,22,20,20,26,18,22,22,20,24,22,22,18,20,24,20,22,22,22,16,20,22,24,18,18,24,18,20]
[null,null,"Pflanzenschutzgerät","01.05.xxxx",6660,20,333,666,5994,5661,null,null,null,2,null,"Pflanzenschutzgerät",6660,6000,6800,7060,6460,6400,8120,5660,7200,6860,6520,7920,7120,7000,5600,6260,7460,6320,7060,7200,6920,5320,6200,7260,7660,5460,5920,7800,6000,6260,null,"Pflanzenschutzgerät",20,18,22,22,20,20,26,18,22,22,20,24,22,22,18,20,24,20,22,22,22,16,20,22,24,18,18,24,18,20]
[null,null,"Düngerstreuer","23.11.xxxx",4100,15,0,4100,0,0,null,null,null,{"$f":"F24","v":15},null,"Düngerstreuer",4100,3690,4185,4350,3975,3930,4995,3480,4425,4230,4020,4875,4380,4305,3450,3855,4590,3900,4350,4425,4260,3285,3810,4470,4710,3360,3645,4800,3690,3855,null,"Düngerstreuer",15,14,16,16,16,16,20,14,18,16,16,18,18,16,14,16,18,16,16,18,16,12,14,18,18,14,14,18,14,16]
[null,null,"Güllefass (1/3)","10.02.xxxx",5400,18,300,300,5100,4800,null,null,null,1,null,"Güllefass (1/3)",5400,4860,5508,5724,5238,5184,6588,4590,5832,5562,5292,6426,5778,5670,4536,5076,6048,5130,5724,5832,5616,4320,5022,5886,6210,4428,4806,6318,4860,5076,null,"Güllefass (1/3)",18,18,20,20,18,18,22,16,20,20,18,22,20,20,16,18,22,18,20,20,20,16,18,20,22,16,18,22,18,18]
[null,null,"Melktechnik","23.04.xxxx",25500,15,0,25500,0,0,null,null,null,{"$f":"F26","v":15},null,"Melktechnik",25500,22950,26010,27030,24735,24480,31110,21675,27540,26265,24990,30345,27285,26775,21420,23970,28560,24225,27030,27540,26520,20400,23715,27795,29325,20910,22695,29835,22950,23970,null,"Melktechnik",15,14,16,16,16,16,20,14,18,16,16,18,18,16,14,16,18,16,16,18,16,12,14,18,18,14,14,18,14,16]
[null,null,"Kippanhänger","12.05.xxxx",2400,20,120,600,1800,1680,null,null,null,5,null,"Kippanhänger",2400,2160,2440,2540,2320,2300,2920,2040,2600,2480,2360,2860,2560,2520,2020,2260,2680,2280,2540,2600,2500,1920,2240,2620,2760,1960,2140,2800,2160,2260,null,"Kippanhänger",20,18,22,22,20,20,26,18,22,22,20,24,22,22,18,20,24,20,22,22,22,16,20,22,24,18,18,24,18,20]
[null,null,"Neuer Ladewagen","02.03.xxxx",25000,15,1666.6666666666667,0,0,23333.333333333332,null,null,null,0,null,"Neuer Ladewagen",25000,22500,25500,26505,24255,24000,30495,21255,27000,25755,24495,29745,26745,26250,21000,23505,28005,23745,26505,27000,25995,19995,23250,27255,28755,20505,22245,29250,22500,23505,null,"Neuer Ladewagen",15,14,16,16,16,16,20,14,18,16,16,18,18,16,14,16,18,16,16,18,16,12,14,18,18,14,14,18,14,16]
[null,null,"Abschreibung ",null,{"$f":"SUM(E18:E28)","v":202106},null,{"$f":"SUM(G18:G28)","v":6799.666666666667}]
[null,null,"Buchwerte",null,null,null,null,null,{"$f":"SUM(I18:I28)","v":88500},{"$f":"SUM(J18:J28)","v":106700.33333333333},null,"Version 2020.11.23.006"]

{"sheet":"BUCHUNGSSÄTZE","index":1,"n_rows":35,"n_cols":42,"rows_kept":35,"cut":false,"hidden":false,"merged":[]}
[null,null,"Buchungssätze",null,null,null,"Gruppe: ",{"$f":"ANLAGENVERZEICHNISSE!J1","v":1}]
[]
[null,null,"Laufende Buchungen",null,null,null,null,null,null,null,null,null,1,2,3,4,5,6,7,8,9,10,11,12,13,14,15,16,17,18,19,20,21,22,23,24,25,26,27,28,29,30]
[null,null,"Datum","Nr.","Text","Soll","Haben","Betrag",null,null,null,null,"Hauptvariante",{"$f":"ANLAGENVERZEICHNISSE!R7","v":-0.1},{"$f":"ANLAGENVERZEICHNISSE!S7","v":0.02},{"$f":"ANLAGENVERZEICHNISSE!T7","v":0.06},{"$f":"ANLAGENVERZEICHNISSE!U7","v":-0.03},{"$f":"ANLAGENVERZEICHNISSE!V7","v":-0.04},{"$f":"ANLAGENVERZEICHNISSE!W7","v":0.22},{"$f":"ANLAGENVERZEICHNISSE!X7","v":-0.15},{"$f":"ANLAGENVERZEICHNISSE!Y7","v":0.08},{"$f":"ANLAGENVERZEICHNISSE!Z7","v":0.03},{"$f":"ANLAGENVERZEICHNISSE!AA7","v":-0.02},{"$f":"ANLAGENVERZEICHNISSE!AB7","v":0.19},{"$f":"ANLAGENVERZEICHNISSE!AC7","v":7.0000000000000007E-2},{"$f":"ANLAGENVERZEICHNISSE!AD7","v":0.05},{"$f":"ANLAGENVERZEICHNISSE!AE7","v":-0.16},{"$f":"ANLAGENVERZEICHNISSE!AF7","v":-0.06},{"$f":"ANLAGENVERZEICHNISSE!AG7","v":0.12},{"$f":"ANLAGENVERZEICHNISSE!AH7","v":-0.05},{"$f":"ANLAGENVERZEICHNISSE!AI7","v":0.06},{"$f":"ANLAGENVERZEICHNISSE!AJ7","v":0.08},{"$f":"ANLAGENVERZEICHNISSE!AK7","v":0.04},{"$f":"ANLAGENVERZEICHNISSE!AL7","v":-0.2},{"$f":"ANLAGENVERZEICHNISSE!AM7","v":-7.0000000000000007E-2},{"$f":"ANLAGENVERZEICHNISSE!AN7","v":0.09},{"$f":"ANLAGENVERZEICHNISSE!AO7","v":0.15},{"$f":"ANLAGENVERZEICHNISSE!AP7","v":-0.18},{"$f":"ANLAGENVERZEICHNISSE!AQ7","v":-0.11},{"$f":"ANLAGENVERZEICHNISSE!AR7","v":0.17},{"$f":"ANLAGENVERZEICHNISSE!AS7","v":-0.1},{"$f":"ANLAGENVERZEICHNISSE!AT7","v":-0.06}]
[null,null,"xx.xx.xxxx",1,"Kauf eines Ladewagens über Giro","Maschinen","Giro",{"$f":"ANLAGENVERZEICHNISSE!E28","v":25000}]
[null,null,"xx.xx.xxxx",2,"Umschuldung: kurzfristiger Kredit wird (teilweise) durch langfristigen getilgt","Kurzfr. Kredit","Langfr. Kredit",{"$f":"IF(TYPE(VLOOKUP($E6,$L$3:$AP$35,$H$1+1,0))=16,\"\",VLOOKUP($E6,$L$3:$AP$35,$H$1+1,0))","v":40000},null,null,null,{"$f":"E6","v":"Umschuldung: kurzfristiger Kredit wird (teilweise) durch langfristigen getilgt"},{"$f":"BUCHFÜHRUNG!K14","v":40000},{"$f":"ROUND($M6+$M6*N$4,0)","v":36000},40800,42400,38800,38400,48800,34000,43200,41200,39200,47600,42800,42000,33600,37600,44800,{"$f":"ROUND($M6+$M6*AD$4,0)","v":38000},42400,43200,41600,32000,37200,43600,46000,32800,35600,46800,36000,37600]
[null,null,"xx.xx.xxxx",3,"Kredittilgung (langfristiger Kredit) über Giro","Langfr. Kredit","Giro",8500,null,null,null,"Kredittilgung (langfristiger Kredit) über Giro",8500,7650,8670,9010,8245,8160,10370,7225,9180,8755,8330,10115,9095,8925,7140,7990,9520,8075,9010,9180,8840,6800,7905,9265,9775,6970,7565,9945,7650,7990]
[null,null,"xx.xx.xxxx",4,"Aufwand für Betriebsmittel der Bodennutzung über Giro","Bodennutzung","Giro",4500,null,null,null,"Aufwand für Betriebsmittel der Bodennutzung über Giro",4500,4050,4590,4770,4365,4320,5490,3825,4860,4635,4410,5355,4815,4725,3780,4230,5040,4275,4770,4860,4680,3600,4185,4905,5175,3690,4005,5265,4050,4230]
[null,null,"xx.xx.xxxx",5,"Verkauf von Milch und Rindern über Giro","Giro","Milchviehhaltung",44125,null,null,null,"Verkauf von Milch und Rindern über Giro",44125,39713,45008,46773,42801,42360,53833,37506,47655,45449,43243,52509,47214,46331,37065,41478,49420,41919,46773,47655,45890,35300,41036,48096,50744,36183,39271,51626,39713,41478]
[null,null,"xx.xx.xxxx",6,"Private Einkäufe bar bezahlt","Privat","Kassa",22150,null,null,null,"Private Einkäufe bar bezahlt",22150,19935,22593,23479,21486,21264,27023,18828,23922,22815,21707,26359,23701,23258,18606,20821,24808,21043,23479,23922,23036,17720,20600,24144,25473,18163,19714,25916,19935,20821]
[null,null,"xx.xx.xxxx",7,"Erhalt der Familienbeihilfe über Giro","Giro","Privat",650,null,null,null,"Erhalt der Familienbeihilfe über Giro",650,585,663,689,631,624,793,553,702,670,637,774,696,683,546,611,728,618,689,702,676,520,605,709,748,533,579,761,585,611]
[null,null,"xx.xx.xxxx",8,"Einnahmen im Rahmen von Urlaub am Bauernhof, bar","Kassa","Ertrag UaB",25000,null,null,null,"Einnahmen im Rahmen von Urlaub am Bauernhof, bar",25000,22500,25500,26500,24250,24000,30500,21250,27000,25750,24500,29750,26750,26250,21000,23500,28000,23750,26500,27000,26000,20000,23250,27250,28750,20500,22250,29250,22500,23500]
[null,null,"xx.xx.xxxx",9,"Aufwendungen für Tierhaltung, UaB und Verwaltung, Giro","Aufw. Tiere, UaB, Verwaltung","Giro",25000,null,null,null,"Aufwendungen für Tierhaltung, UaB und Verwaltung, Giro",25000,22500,25500,26500,24250,24000,30500,21250,27000,25750,24500,29750,26750,26250,21000,23500,28000,23750,26500,27000,26000,20000,23250,27250,28750,20500,22250,29250,22500,23500]
[null,null,"xx.xx.xxxx",10,"Bezahlung von Schuldzinsen über Giro","Schuldzinsen","Giro",1100,null,null,null,"Bezahlung von Schuldzinsen über Giro",1100,990,1122,1166,1067,1056,1342,935,1188,1133,1078,1309,1177,1155,924,1034,1232,1045,1166,1188,{"$f":"ROUND($M14+$M14*AG$4,0)","v":1144},880,1023,1199,1265,902,979,1287,990,1034]
[null,null,"xx.xx.xxxx",11,"Ertrag durch Mastviehverkäufe über Giro","Giro","Mastvieh",7450,null,null,null,"Ertrag durch Mastviehverkäufe über Giro",7450,6705,7599,7897,7227,7152,9089,6333,8046,7674,7301,8866,7972,7823,6258,7003,8344,7078,7897,8046,7748,5960,6929,8121,8568,6109,6631,8717,6705,7003]
[null,null,"xx.xx.xxxx",12,"Forderungen vom Vorjahr werden über Giro überwiesen","Giro","Forderungen",14800,null,null,null,"Forderungen vom Vorjahr werden über Giro überwiesen",14800,13320,15096,15688,14356,14208,18056,12580,15984,15244,14504,17612,15836,15540,12432,13912,16576,14060,15688,15984,15392,11840,13764,16132,17020,12136,13172,17316,13320,13912]
[null,null,"xx.xx.xxxx",13,"Bezahlung der Stromrechnung über Giro","Strom","Giro",1850,null,null,null,"Bezahlung der Stromrechnung über Giro",1850,1665,1887,1961,1795,1776,2257,1573,1998,1906,1813,2202,1980,1943,1554,1739,2072,1758,1961,1998,1924,1480,1721,2017,2128,1517,1647,2165,1665,1739]
[]
[null,null,"Vorbereitende Jahresabschlussbuchungen"]
[null,null,"Verbuchung der AfA"]
[null,null,"Datum","Beleg Nr.","Text","Soll","Haben","Betrag"]
[null,null,"31.12.xxxx",{"$f":"+D17+1","v":14},"AfA Wirtschaftsgebäude","AfA","Gebäude",{"$f":"+ANLAGENVERZEICHNISSE!G13","v":11300}]
[null,null,"31.12.xxxx",{"$f":"+D22+1","v":15},"AfA Maschinen","AfA","Maschinen",{"$f":"+ANLAGENVERZEICHNISSE!G29","v":6799.666666666667}]
[]
[null,null,"Abgrenzung Betrieb und Privat"]
[null,null,"Datum","Beleg Nr.","Text","Soll","Haben","Betrag"]
[null,null,"31.12.xxxx",{"$f":"+D23+1","v":16},{"$f":"\"Aufteilung der Stromkosten: \"&IF(TYPE(VLOOKUP($L27,$L$3:$AP$35,$H$1+1,0))=16,\"\",TEXT(VLOOKUP($L27,$L$3:$AP$35,$H$1+1,0),\"0%\")&\" Betrieb, \"&TEXT(1-IF(TYPE(VLOOKUP($L27,$L$3:$AP$35,$H$1+1,0))=16,\"\",VLOOKUP($L27,$L$3:$AP$35,$H$1+1,0)),\"0%\"))&\" Privat\"","v":"Aufteilung der Stromkosten: 20% Betrieb, 80% Privat"},"Privat","Strom",{"$f":"H17*IF(TYPE(VLOOKUP($L27,$L$3:$AP$35,$H$1+1,0))=16,\"\",VLOOKUP($L27,$L$3:$AP$35,$H$1+1,0))","v":370},null,null,null,"Aufteilung der Stromkosten: Betrieb, Privat",0.2,{"$f":"ROUND($M27+$M27*N$4,2)","v":0.18},{"$f":"ROUND($M27+$M27*O$4,2)","v":0.2},0.21,0.19,0.19,0.24,0.17,0.22,0.21,0.2,0.24,0.21,0.21,0.17,0.19,0.22,0.19,0.21,0.22,0.21,0.16,0.19,0.22,0.23,0.16,0.18,0.23,0.18,0.19]
[]
[null,null,"Buchung von Naturallieferungen"]
[null,null,"Datum","Beleg Nr.","Text","Soll","Haben","Betrag"]
[null,null,"31.12.xxxx",17,"Milch an den Haushalt","Privat","Ertrag Milch",{"$f":"IF(TYPE(VLOOKUP($E31,$L$3:$AP$35,$H$1+1,0))=16,\"\",VLOOKUP($E31,$L$3:$AP$35,$H$1+1,0))","v":165},null,null,null,{"$f":"E31","v":"Milch an den Haushalt"},165,{"$f":"ROUND($M31+$M31*N$4,0)","v":149},168,175,160,158,201,140,178,170,162,196,177,173,139,155,185,157,175,178,172,132,153,180,190,135,147,193,149,155]
[]
[null,null,"Buchung von Bestandesveränderungen"]
[null,null,"Datum","Beleg Nr.","Text","Soll","Haben","Betrag"]
[null,null,"31.12.xxxx",18,{"$f":"IF(VLOOKUP($L35,$L$3:$AP$35,$H$1+1,0)<0,\"Minderwert Viehvermögen\",\"Mehrwert Viehvermögen\")","v":"Minderwert Viehvermögen"},{"$f":"IF(VLOOKUP($L35,$L$3:$AP$35,$H$1+1,0)<0,\"Ertrag Mastvieh\",\"Viehvermögen\")","v":"Ertrag Mastvieh"},{"$f":"IF(VLOOKUP($L35,$L$3:$AP$35,$H$1+1,0)>0,\"Ertrag Mastvieh\",\"Viehvermögen\")","v":"Viehvermögen"},{"$f":"IF(TYPE(VLOOKUP($L35,$L$3:$AP$35,$H$1+1,0))=16,\"\",IF(VLOOKUP($L35,$L$3:$AP$35,$H$1+1,0)<0,-VLOOKUP($L35,$L$3:$AP$35,$H$1+1,0),VLOOKUP($L35,$L$3:$AP$35,$H$1+1,0)))","v":1550},null,null,null,"Veränderung Vienvermögen",-1550,{"$f":"ROUND($M35+$M35*N$4,0)","v":-1395},{"$f":"-ROUND($M35+$M35*O$4,0)","v":1581},-1643,-1504,{"$f":"-ROUND($M35+$M35*R$4,0)","v":1488},-1891,-1318,-1674,-1597,-1519,-1845,-1659,-1628,{"$f":"-ROUND($M35+$M35*AA$4,0)","v":1302},{"$f":"-ROUND($M35+$M35*AB$4,0)","v":1457},1736,1473,-1643,-1674,-1612,-1240,-1442,-1690,-1783,-1271,-1380,-1814,-1395,{"$f":"-ROUND($M35+$M35*AP$4,0)","v":1457}]

{"sheet":"BUCHFÜHRUNG","index":2,"n_rows":159,"n_cols":40,"rows_kept":159,"cut":false,"hidden":false,"merged":[[146,2,146,5],[153,2,153,5],[108,2,108,5],[113,2,113,5],[118,2,118,5],[123,2,123,5],[128,2,128,5],[135,2,135,5],[141,2,141,5],[96,2,96,5],[102,2,102,5],[79,2,79,5],[3,2,3,5],[69,2,69,5],[74,2,74,5],[89,2,89,5],[13,2,13,5],[52,2,52,5],[57,2,57,5],[63,2,63,5],[23,2,23,5],[33,2,33,5],[40,2,40,5]]}
[null,null,"Buchführung",null,"Gruppe: ",{"$f":"ANLAGENVERZEICHNISSE!J1","v":1}]
[]
[null,null,"Evidenzkonten",null,null,null,null,null,null,null,1,2,3,4,5,6,7,8,9,10,11,12,13,14,15,16,17,18,19,20,21,22,23,24,25,26,27,28,29,30]
[null,null,"Eröffnungsbilanz zum 01.01.xxxx",null,null,null,null,null,null,"1.1.xxxx","Hauptvariante",{"$f":"ANLAGENVERZEICHNISSE!R7","v":-0.1},{"$f":"ANLAGENVERZEICHNISSE!S7","v":0.02},{"$f":"ANLAGENVERZEICHNISSE!T7","v":0.06},{"$f":"ANLAGENVERZEICHNISSE!U7","v":-0.03},{"$f":"ANLAGENVERZEICHNISSE!V7","v":-0.04},{"$f":"ANLAGENVERZEICHNISSE!W7","v":0.22},{"$f":"ANLAGENVERZEICHNISSE!X7","v":-0.15},{"$f":"ANLAGENVERZEICHNISSE!Y7","v":0.08},{"$f":"ANLAGENVERZEICHNISSE!Z7","v":0.03},{"$f":"ANLAGENVERZEICHNISSE!AA7","v":-0.02},{"$f":"ANLAGENVERZEICHNISSE!AB7","v":0.19},{"$f":"ANLAGENVERZEICHNISSE!AC7","v":7.0000000000000007E-2},{"$f":"ANLAGENVERZEICHNISSE!AD7","v":0.05},{"$f":"ANLAGENVERZEICHNISSE!AE7","v":-0.16},{"$f":"ANLAGENVERZEICHNISSE!AF7","v":-0.06},{"$f":"ANLAGENVERZEICHNISSE!AG7","v":0.12},{"$f":"ANLAGENVERZEICHNISSE!AH7","v":-0.05},{"$f":"ANLAGENVERZEICHNISSE!AI7","v":0.06},{"$f":"ANLAGENVERZEICHNISSE!AJ7","v":0.08},{"$f":"ANLAGENVERZEICHNISSE!AK7","v":0.04},{"$f":"ANLAGENVERZEICHNISSE!AL7","v":-0.2},{"$f":"ANLAGENVERZEICHNISSE!AM7","v":-7.0000000000000007E-2},{"$f":"ANLAGENVERZEICHNISSE!AN7","v":0.09},{"$f":"ANLAGENVERZEICHNISSE!AO7","v":0.15},{"$f":"ANLAGENVERZEICHNISSE!AP7","v":-0.18},{"$f":"ANLAGENVERZEICHNISSE!AQ7","v":-0.11},{"$f":"ANLAGENVERZEICHNISSE!AR7","v":0.17},{"$f":"ANLAGENVERZEICHNISSE!AS7","v":-0.1},{"$f":"ANLAGENVERZEICHNISSE!AT7","v":-0.06}]
[null,null,"Gebäude und baul. Anlagen",{"$f":"ANLAGENVERZEICHNISSE!I14","v":134400},"Eigenkapital",{"$f":"SUM(D5:D11)-SUM(F6:F11)","v":185049.59999999998}]
[null,null,"Maschinen und Geräte",{"$f":"ANLAGENVERZEICHNISSE!I30","v":88500},"Langfristiger Kredit",{"$f":"IF(TYPE(VLOOKUP($E6,$J$3:$AN$14,$F$1+1,0))=16,\"\",VLOOKUP($E6,$J$3:$AN$14,$F$1+1,0))","v":50000}]
[null,null,"Bestand Vieh",{"$f":"IF(TYPE(VLOOKUP($C7,$J$3:$AN$14,$F$1+1,0))=16,\"\",VLOOKUP($C7,$J$3:$AN$14,$F$1+1,0))","v":33550},"Kurzfristiger Kredit",{"$f":"IF(TYPE(VLOOKUP($E7,$J$3:$AN$14,$F$1+1,0))=16,\"\",VLOOKUP($E7,$J$3:$AN$14,$F$1+1,0))","v":40000},null,null,null,{"$f":"C7","v":"Bestand Vieh"},33550,{"$f":"ROUND($K7+$K7*L$4,0)","v":30195},{"$f":"ROUND($K7+$K7*M$4,0)","v":34221},35563,32544,32208,40931,28518,36234,34557,32879,39925,35899,35228,28182,31537,37576,31873,35563,36234,34892,26840,31202,36570,38583,27511,29860,39254,30195,31537]
[null,null,"Zugekaufte Vorräte",{"$f":"IF(TYPE(VLOOKUP($C8,$J$3:$AN$14,$F$1+1,0))=16,\"\",VLOOKUP($C8,$J$3:$AN$14,$F$1+1,0))","v":1249.6000000000001},null,null,null,null,null,{"$f":"C8","v":"Zugekaufte Vorräte"},1249.6000000000001,{"$f":"ROUND($K8+$K8*L$4,0)","v":1125},1275,1325,1212,1200,1525,1062,1350,1287,1225,1487,1337,1312,1050,1175,1400,1187,1325,1350,1300,1000,1162,1362,1437,1025,1112,1462,1125,1175]
[null,null,"Forderungen (Div. KK)",14800,null,null,null,null,null,{"$f":"C9","v":"Forderungen (Div. KK)"},14800,13320,15096,15688,14356,14208,18056,12580,15984,15244,14504,17612,15836,15540,12432,13912,16576,14060,15688,15984,15392,11840,13764,16132,17020,12136,13172,17316,13320,13912]
[null,null,"Girokonto",2300,null,null,null,null,null,{"$f":"C10","v":"Girokonto"},2300,2070,2346,2438,2231,2208,2806,1955,2484,2369,2254,2737,2461,2415,1932,2162,2576,2185,2438,2484,2392,1840,2139,2507,2645,1886,2047,2691,2070,2162]
[null,null,"Kassa",250,null,null,null,null,null,{"$f":"C11","v":"Kassa"},250,225,255,265,243,240,305,213,270,258,245,298,268,263,210,235,280,238,265,270,260,200,233,273,288,205,223,293,225,235]
[null,null,"Aktiva",{"$f":"SUM(D5:D11)","v":275049.59999999998},"Passiva",{"$f":"SUM(F5:F11)","v":275049.59999999998}]
[null,null,null,null,null,null,null,null,null,{"$f":"E6","v":"Langfristiger Kredit"},50000,45000,51000,53000,48500,48000,61000,42500,54000,51500,49000,59500,53500,52500,42000,47000,56000,47500,53000,54000,52000,40000,46500,54500,57500,41000,44500,58500,45000,47000]
[null,null,"Schlussbilanz zum 31.12.xxxx",null,null,null,null,null,null,{"$f":"E7","v":"Kurzfristiger Kredit"},40000,36000,40800,42400,38800,38400,48800,34000,43200,41200,39200,47600,42800,42000,33600,37600,44800,38000,42400,43200,41600,32000,37200,43600,46000,32800,35600,46800,36000,37600]
[null,null,"Wirtschaftsgebäude",{"$f":"ANLAGENVERZEICHNISSE!J14","v":123100},"Eigenkapital",{"$f":"SUM(D15:D21)-SUM(F16:F21)","v":188024.93333333329}]
[null,null,"Maschinen und Geräte",{"$f":"ANLAGENVERZEICHNISSE!J30","v":106700.33333333333},"Langfristiger Kredit",{"$f":"IF(D100<>\"\",D100,F100)","v":81500},null,null,null,"31.12.xxxx"]
[null,null,"Bestand Vieh",{"$f":"IF(BUCHUNGSSÄTZE!E35=\"Mehrwert Viehvermögen\",D7+BUCHUNGSSÄTZE!H35,D7-BUCHUNGSSÄTZE!H35)","v":32000},{"$f":"IF(D105<>\"---------------\",\"Kurzfristiger Kredit\",IF(F105<>\"---------------\",\"Kurzfristiger Kredit\",\"\"))","v":""},{"$f":"IF(D105<>\"---------------\",D105,IF(F105<>\"---------------\",F105,\"\"))","v":""},null,null,null,"Kurzfristiger Kredit",0,{"$f":"ROUND($K17+$K17*L$4,0)","v":0},0,0,0,0,0,0,0,0,0,0,0,0,0,0,0,0,0,0,0,0,0,0,0,0,0,0,0,0]
[null,null,"Zugekaufte Vorräte",{"$f":"IF(D72<>\"\",D72,F72)","v":1249.6000000000001}]
[null,null,"Forderungen",{"$f":"IF(D77<>\"\",D77,F77)","v":"---------------"},null,null,null,null,null,{"$f":"C19","v":"Forderungen"},0,0,0,0,0,0,0,0,0,0,0,0,0,0,0,0,0,0,0,0,0,0,0,0,0,0,0,0,0,0]
[null,null,"Kassa",{"$f":"IF(D93<>\"\",D93,F93)","v":3100}]
[null,null,"Girokonto",{"$f":"IF(D87<>\"\",D87,F87)","v":3375}]
[null,null,"Aktiva",{"$f":"SUM(D15:D21)","v":269524.93333333329},"Passiva",{"$f":"SUM(F15:F21)","v":269524.93333333329}]
[]
[null,null,"Gewinn- und Verlustrechnung",null,null,null,null,null,"G/V lt. GUV-Rechnung",{"$f":"D31","v":25010.333333333336}]
[null,null,"Bodennutzung",{"$f":"IF(D111<>\"\",D111,F111)","v":4500},"Milchkuhhaltung",{"$f":"IF(D139<>\"\",D139,F139)","v":44290},null,null,{"$f":"I30","v":"G/V lt Bilanzvergleich"}]
[null,null,"Tiere, UaB, Verwaltung",{"$f":"IF(D116<>\"\",D116,F116)","v":25000},"Urlaub am Bauernhof",{"$f":"IF(D144<>\"\",D144,F144)","v":25000},null,null,"EK 31.12.",{"$f":"F15","v":188024.93333333329}]
[null,null,"Schuldzinsen",{"$f":"IF(D121<>\"\",D121,F121)","v":1100},"Mastvieh",{"$f":"IF(D150<>\"\",D150,F150)","v":5900},null,null,"-  EK 1.1.",{"$f":"-F5","v":-185049.59999999998}]
[null,null,"Strom",{"$f":"IF(D126<>\"\",D126,F126)","v":1480},null,null,null,null,"+ Privarverbrauch",{"$f":"SUM(D35:D37)","v":22685}]
[null,null,"Abschreibung Gebäude",{"$f":"IF(D130<>\"\",D130,F130)","v":11300},null,null,null,null,"-  Privateinlage",{"$f":"-SUM(F35:F37)","v":-650}]
[null,null,"Abschreibung Maschinen",{"$f":"IF(D131<>\"\",D131,F131)","v":6799.666666666667},null,null,null,null,"G/V lt Bilanzvergleich",{"$f":"SUM(J26:J29)","v":25010.333333333314}]
[null,null,{"$f":"IF(D31=\"\",\"\",IF(D31=\"---------------\",\"------------------------------------------------\",\"Saldo (Gewinn)\"))","v":"Saldo (Gewinn)"},{"$f":"IF(SUM(F25:F30)-SUM(D25:D30)<0,\"\",IF(SUM(F25:F30)=SUM(D25:D30),\"---------------\",SUM(F25:F30)-SUM(D25:D30)))","v":25010.333333333336},{"$f":"IF(F31=\"\",\"\",IF(F31=\"---------------\",\"------------------------------------------------\",\"Saldo (Verlust)\"))","v":""},{"$f":"IF(SUM(D25:D30)-SUM(F25:F30)<0,\"\",IF(SUM(D25:D30)=SUM(F25:F30),\"---------------\",SUM(D25:D30)-SUM(F25:F30)))","v":""},null,null,"Differenz",{"$f":"J24-J30","v":0}]
[null,null,"Summe",{"$f":"SUM(D25:D31)","v":75190},"Summe",{"$f":"SUM(F25:F31)","v":75190}]
[]
[null,null,"Privat"]
[null,null,"Privatausgaben Haushalt",{"$f":"F91","v":22150},"Familienbeihilfe",{"$f":"D83","v":650}]
[null,null,"Privatanteil (Strom)",{"$f":"BUCHUNGSSÄTZE!H27","v":370}]
[null,null,"Naturallieferung (Milch)",{"$f":"BUCHUNGSSÄTZE!H31","v":165}]
[null,null,{"$f":"IF(D38=\"\",\"\",IF(D38=\"---------------\",\"------------------------------------------------\",\"Saldo\"))","v":""},{"$f":"IF(SUM(F35:F37)-SUM(D35:D37)<0,\"\",IF(SUM(F35:F37)=SUM(D35:D37),\"---------------\",SUM(F35:F37)-SUM(D35:D37)))","v":""},{"$f":"IF(F38=\"\",\"\",IF(F38=\"---------------\",\"------------------------------------------------\",\"Saldo\"))","v":"Saldo"},{"$f":"IF(SUM(D35:D37)-SUM(F35:F37)<0,\"\",IF(SUM(D35:D37)=SUM(F35:F37),\"---------------\",SUM(D35:D37)-SUM(F35:F37)))","v":22035}]
[null,null,"Summe",{"$f":"SUM(D35:D38)","v":22685},"Summe",{"$f":"SUM(F35:F38)","v":22685}]
[]
[null,null,"Eigenkapital"]
[null,null,"Privatentnahmen",{"$f":"F38","v":22035},"AB",{"$f":"F5","v":185049.59999999998}]
[null,null,{"$f":"IF(D43=\"\",\"\",\"Verlust\")","v":""},{"$f":"IF(F31=\"\",\"\",F31)","v":""},{"$f":"IF(F43=\"\",\"\",\"Gewinn\")","v":"Gewinn"},{"$f":"IF(D31=\"\",\"\",D31)","v":25010.333333333336}]
[null,null,{"$f":"IF(D44=\"\",\"\",IF(D44=\"---------------\",\"------------------------------------------------\",\"Saldo\"))","v":"Saldo"},{"$f":"IF(SUM(F42:F43)-SUM(D42:D43)<0,\"\",IF(SUM(F42:F43)=SUM(D42:D43),\"---------------\",SUM(F42:F43)-SUM(D42:D43)))","v":188024.93333333332},{"$f":"IF(F44=\"\",\"\",IF(F44=\"---------------\",\"------------------------------------------------\",\"Saldo\"))","v":""},{"$f":"IF(SUM(D42:D43)-SUM(F42:F43)<0,\"\",IF(SUM(D42:D43)=SUM(F42:F43),\"---------------\",SUM(D42:D43)-SUM(F42:F43)))","v":""}]
[null,null,"Aktiva",{"$f":"SUM(D42:D44)","v":210059.93333333332},"Passiva",{"$f":"SUM(F42:F43)","v":210059.93333333332}]
[]
[null,null,"Weitere Angaben"]
[null,null,"Lohnansatz",{"$f":"IF(TYPE(VLOOKUP($C48,$J$3:$AN$49,$F$1+1,0))=16,\"\",VLOOKUP($C48,$J$3:$AN$49,$F$1+1,0))","v":21297}," Euro",null,null,null,null,{"$f":"C48","v":"Lohnansatz"},21297,{"$f":"ROUND($K48+$K48*L$4,0)","v":19167},21723,22575,20658,20445,25982,18102,23001,21936,20871,25343,22788,22362,17889,20019,23853,20232,22575,23001,22149,17038,19806,23214,24492,17464,18954,24917,19167,20019]
[null,null,"Zinssatz",{"$f":"IF(TYPE(VLOOKUP($C49,$J$3:$AN$49,$F$1+1,0))=16,\"\",VLOOKUP($C49,$J$3:$AN$49,$F$1+1,0))","v":3.5}," Prozent",{"$f":"-F15*D49/100","v":-6580.8726666666653},null,null,null,{"$f":"C49","v":"Zinssatz"},3.5,{"$f":"ROUND($K49+$K49*L$4,1)","v":3.2},{"$f":"ROUND($K49+$K49*M$4,1)","v":3.6},3.7,3.4,3.4,4.3,3,3.8,3.6,3.4,4.2,3.7,3.7,2.9,3.3,3.9,3.3,3.7,3.8,3.6,2.8,3.3,3.8,4,2.9,3.1,4.0999999999999996,3.2,3.3]
[]
[null,null,"Buchung auf KONTEN"]
[null,null,"Aktive Bestandeskonten"]
[null,null,"Gebäude und bauliche Anlagen (Wirtschaftsgebäude)"]
[null,null,"AB",{"$f":"+D5","v":134400},"AfA (Wirtschaftsgebäude)",{"$f":"+BUCHUNGSSÄTZE!H22","v":11300}]
[null,null,{"$f":"IF(D55=\"\",\"\",IF(D55=\"---------------\",\"------------------------------------------------\",\"Saldo\"))","v":""},{"$f":"IF(SUM(F54)-SUM(D54)<0,\"\",IF(SUM(F54)=SUM(D54),\"---------------\",SUM(F54)-SUM(D54)))","v":""},{"$f":"IF(F55=\"\",\"\",IF(F55=\"---------------\",\"------------------------------------------------\",\"Saldo\"))","v":"Saldo"},{"$f":"IF(SUM(D54)-SUM(F54)<0,\"\",IF(SUM(D54)=SUM(F54),\"---------------\",SUM(D54)-SUM(F54)))","v":123100}]
[null,null,"Aktiva",{"$f":"SUM(D54:D55)","v":134400},"Passiva",{"$f":"D56","v":134400}]
[]
[null,null,"Maschinen und Geräte"]
[null,null,"AB",{"$f":"+D6","v":88500},"Afa (Maschinen)",{"$f":"+BUCHUNGSSÄTZE!H23","v":6799.666666666667}]
[null,null,"Kauf Ladewagen",{"$f":"BUCHUNGSSÄTZE!H5","v":25000}]
[null,null,{"$f":"IF(D61=\"\",\"\",IF(D61=\"---------------\",\"------------------------------------------------\",\"Saldo\"))","v":""},{"$f":"IF(SUM(F59:F60)-SUM(D59:D60)<0,\"\",IF(SUM(F59:F60)=SUM(D59:D60),\"---------------\",SUM(F59:F60)-SUM(D59:D60)))","v":""},{"$f":"IF(F61=\"\",\"\",IF(F61=\"---------------\",\"------------------------------------------------\",\"Saldo\"))","v":"Saldo"},{"$f":"IF(SUM(D59:D60)-SUM(F59:F60)<0,\"\",IF(SUM(D59:D60)=SUM(F59:F60),\"---------------\",SUM(D59:D60)-SUM(F59:F60)))","v":106700.33333333333}]
[null,null,"Aktiva",{"$f":"SUM(D59:D60)","v":113500},"Passiva",{"$f":"D62","v":113500}]
[]
[null,null,"Viehvermögen"]
[null,null,"AB",{"$f":"+D7","v":33550}]
[null,null,{"$f":"IF(BUCHUNGSSÄTZE!E35=\"Mehrwert Viehvermögen\",\"Mehrwert Viehvermögen\",\"\")","v":""},{"$f":"IF(BUCHUNGSSÄTZE!E35=\"Mehrwert Viehvermögen\",BUCHUNGSSÄTZE!H35,\"\")","v":""},{"$f":"IF(BUCHUNGSSÄTZE!E35=\"Minderwert Viehvermögen\",\"Minderwert Viehvermögen\",\"\")","v":"Minderwert Viehvermögen"},{"$f":"IF(BUCHUNGSSÄTZE!E35=\"Minderwert Viehvermögen\",BUCHUNGSSÄTZE!H35,\"\")","v":1550}]
[null,null,{"$f":"IF(D67=\"\",\"\",IF(D67=\"---------------\",\"------------------------------------------------\",\"Saldo\"))","v":""},{"$f":"IF(SUM(F65:F66)-SUM(D65:D66)<0,\"\",IF(SUM(F65:F66)=SUM(D65:D66),\"---------------\",SUM(F65:F66)-SUM(D65:D66)))","v":""},{"$f":"IF(F67=\"\",\"\",IF(F67=\"---------------\",\"------------------------------------------------\",\"Saldo\"))","v":"Saldo"},{"$f":"IF(SUM(D65:D66)-SUM(F65:F66)<0,\"\",IF(SUM(D65:D66)=SUM(F65:F66),\"---------------\",SUM(D65:D66)-SUM(F65:F66)))","v":32000}]
[null,null,"Aktiva",{"$f":"SUM(D65:D66)","v":33550},"Passiva",{"$f":"D68","v":33550}]
[]
[null,null,"Zugekaufte Vorräte"]
[null,null,"AB",{"$f":"+D8","v":1249.6000000000001}]
[null,null,{"$f":"IF(D72=\"\",\"\",IF(D72=\"---------------\",\"------------------------------------------------\",\"Saldo\"))","v":""},{"$f":"IF(SUM(F71)-SUM(D71)<0,\"\",IF(SUM(F71)=SUM(D71),\"---------------\",SUM(F71)-SUM(D71)))","v":""},{"$f":"IF(F72=\"\",\"\",IF(F72=\"---------------\",\"------------------------------------------------\",\"Saldo\"))","v":"Saldo"},{"$f":"IF(SUM(D71)-SUM(F71)<0,\"\",IF(SUM(D71)=SUM(F71),\"---------------\",SUM(D71)-SUM(F71)))","v":1249.6000000000001}]
[null,null,"Aktiva",{"$f":"SUM(D71)","v":1249.6000000000001},"Passiva",{"$f":"D73","v":1249.6000000000001}]
[]
[null,null,"Forderungen"]
[null,null,"AB",{"$f":"+D9","v":14800},"Erhalt Forderung (Vorjahr)",{"$f":"+BUCHUNGSSÄTZE!H16","v":14800}]
[null,null,{"$f":"IF(D77=\"\",\"\",IF(D77=\"---------------\",\"------------------------------------------------\",\"Saldo\"))","v":"------------------------------------------------"},{"$f":"IF(SUM(F76)-SUM(D76)<0,\"\",IF(SUM(F76)=SUM(D76),\"---------------\",SUM(F76)-SUM(D76)))","v":"---------------"},{"$f":"IF(F77=\"\",\"\",IF(F77=\"---------------\",\"------------------------------------------------\",\"Saldo\"))","v":"------------------------------------------------"},{"$f":"IF(SUM(D76)-SUM(F76)<0,\"\",IF(SUM(D76)=SUM(F76),\"---------------\",SUM(D76)-SUM(F76)))","v":"---------------"}]
[null,null,"Aktiva",{"$f":"SUM(D76)","v":14800},"Passiva",{"$f":"D78","v":14800}]
[]
[null,null,"Girokonto"]
[null,null,"AB",{"$f":"+D10","v":2300},"Kauf Ladewagen",{"$f":"BUCHUNGSSÄTZE!H5","v":25000}]
[null,null,"Einnahme Milchviehhaltung",{"$f":"+BUCHUNGSSÄTZE!H9","v":44125},"Tilgung (langfrisitger Kredit)",{"$f":"+BUCHUNGSSÄTZE!H7","v":8500}]
[null,null,"Familienbeihilfe",{"$f":"+BUCHUNGSSÄTZE!H11","v":650},"Aufwand Bodennutzung",{"$f":"+BUCHUNGSSÄTZE!H8","v":4500}]
[null,null,"Mastviehverkauf",{"$f":"+BUCHUNGSSÄTZE!H15","v":7450},"Diverse Aufwendungen",{"$f":"+BUCHUNGSSÄTZE!H13","v":25000}]
[null,null,"Erhalt Forderung (Vorjahr)",{"$f":"+BUCHUNGSSÄTZE!H16","v":14800},"Bezahlung Schuldzinsen",{"$f":"+BUCHUNGSSÄTZE!H14","v":1100}]
[null,null,null,null,"Bezahlung Stromrechnung",{"$f":"+BUCHUNGSSÄTZE!H17","v":1850}]
[null,null,{"$f":"IF(D87=\"\",\"\",IF(D87=\"---------------\",\"------------------------------------------------\",\"Saldo\"))","v":""},{"$f":"IF(SUM(F81:F86)-SUM(D81:D86)<0,\"\",IF(SUM(F81:F86)=SUM(D81:D86),\"---------------\",SUM(F81:F86)-SUM(D81:D86)))","v":""},{"$f":"IF(F87=\"\",\"\",IF(F87=\"---------------\",\"------------------------------------------------\",\"Saldo\"))","v":"Saldo"},{"$f":"IF(SUM(D81:D86)-SUM(F81:F86)<0,\"\",IF(SUM(D81:D86)=SUM(F81:F86),\"---------------\",SUM(D81:D86)-SUM(F81:F86)))","v":3375}]
[null,null,"Aktiva",{"$f":"SUM(D81:D87)","v":69325},"Passiva",{"$f":"D88","v":69325}]
[]
[null,null,"Kassa"]
[null,null,"AB",{"$f":"+D11","v":250},"Privateinkäufe",{"$f":"+BUCHUNGSSÄTZE!H10","v":22150}]
[null,null,"Einnahmen UaB",{"$f":"+BUCHUNGSSÄTZE!H12","v":25000}]
[null,null,{"$f":"IF(D93=\"\",\"\",IF(D93=\"---------------\",\"------------------------------------------------\",\"Saldo\"))","v":""},{"$f":"IF(SUM(F91:F92)-SUM(D91:D92)<0,\"\",IF(SUM(F91:F92)=SUM(D91:D92),\"---------------\",SUM(F91:F92)-SUM(D91:D92)))","v":""},{"$f":"IF(F93=\"\",\"\",IF(F93=\"---------------\",\"------------------------------------------------\",\"Saldo\"))","v":"Saldo"},{"$f":"IF(SUM(D91:D92)-SUM(F91:F92)<0,\"\",IF(SUM(D91:D92)=SUM(F91:F92),\"---------------\",SUM(D91:D92)-SUM(F91:F92)))","v":3100}]
[null,null,"Aktiva",{"$f":"SUM(D91:D92)","v":25250},"Passiva",{"$f":"D94","v":25250}]
[]
[null,null,"Passive Bestandeskonten"]
[null,null,"Langfristige Kredit"]
[null,null,"Tilgung (langfristiger Kredit)",{"$f":"+BUCHUNGSSÄTZE!H7","v":8500},"AB",{"$f":"+F6","v":50000}]
[null,null,null,null,"Umschuldung",{"$f":"+BUCHUNGSSÄTZE!H6","v":40000}]
[null,null,{"$f":"IF(D100=\"\",\"\",IF(D100=\"---------------\",\"------------------------------------------------\",\"Saldo\"))","v":"Saldo"},{"$f":"IF(SUM(F98:F99)-SUM(D98:D99)<0,\"\",IF(SUM(F98:F99)=SUM(D98:D99),\"---------------\",SUM(F98:F99)-SUM(D98:D99)))","v":81500},{"$f":"IF(F100=\"\",\"\",IF(F100=\"---------------\",\"------------------------------------------------\",\"Saldo\"))","v":""},{"$f":"IF(SUM(D98:D99)-SUM(F98:F99)<0,\"\",IF(SUM(D98:D99)=SUM(F98:F99),\"---------------\",SUM(D98:D99)-SUM(F98:F99)))","v":""}]
[null,null,"Aktiva",{"$f":"F101","v":90000},"Passiva",{"$f":"SUM(F98:F99)","v":90000}]
[]
[null,null,"Kurzfristiger Kredit"]
[null,null,"Umschuldung",{"$f":"+BUCHUNGSSÄTZE!H6","v":40000},"AB",{"$f":"+F7","v":40000}]
[null,null,{"$f":"IF(D105=\"\",\"\",IF(D105=\"---------------\",\"------------------------------------------------\",\"Saldo\"))","v":"------------------------------------------------"},{"$f":"IF(SUM(F104)-SUM(D104)<0,\"\",IF(SUM(F104)=SUM(D104),\"---------------\",SUM(F104)-SUM(D104)))","v":"---------------"},{"$f":"IF(F105=\"\",\"\",IF(F105=\"---------------\",\"------------------------------------------------\",\"Saldo\"))","v":"------------------------------------------------"},{"$f":"IF(SUM(D104)-SUM(F104)<0,\"\",IF(SUM(D104)=SUM(F104),\"---------------\",SUM(D104)-SUM(F104)))","v":"---------------"}]
[null,null,"Aktiva",{"$f":"F106","v":40000},"Passiva",{"$f":"SUM(F104)","v":40000}]
[]
[null,null,"Aufwandskonten"]
[null,null,"Bodennutzung"]
[null,null,"Aufwand Bodennutzung",{"$f":"BUCHUNGSSÄTZE!H8","v":4500}]
[null,null,{"$f":"IF(D111=\"\",\"\",IF(D111=\"---------------\",\"------------------------------------------------\",\"Saldo\"))","v":""},{"$f":"IF(SUM(F110)-SUM(D110)<0,\"\",IF(SUM(F110)=SUM(D110),\"---------------\",SUM(F110)-SUM(D110)))","v":""},{"$f":"IF(F111=\"\",\"\",IF(F111=\"---------------\",\"------------------------------------------------\",\"Saldo\"))","v":"Saldo"},{"$f":"IF(SUM(D110)-SUM(F110)<0,\"\",IF(SUM(D110)=SUM(F110),\"---------------\",SUM(D110)-SUM(F110)))","v":4500}]
[null,null,"Aktiva",{"$f":"SUM(D110)","v":4500},"Passiva",{"$f":"D112","v":4500}]
[]
[null,null,"Tiere, UaB, Verwaltung"]
[null,null,"Diverser Aufwendungen",{"$f":"BUCHUNGSSÄTZE!H13","v":25000}]
[null,null,{"$f":"IF(D116=\"\",\"\",IF(D116=\"---------------\",\"------------------------------------------------\",\"Saldo\"))","v":""},{"$f":"IF(SUM(F115)-SUM(D115)<0,\"\",IF(SUM(F115)=SUM(D115),\"---------------\",SUM(F115)-SUM(D115)))","v":""},{"$f":"IF(F116=\"\",\"\",IF(F116=\"---------------\",\"------------------------------------------------\",\"Saldo\"))","v":"Saldo"},{"$f":"IF(SUM(D115)-SUM(F115)<0,\"\",IF(SUM(D115)=SUM(F115),\"---------------\",SUM(D115)-SUM(F115)))","v":25000}]
[null,null,"Aktiva",{"$f":"SUM(D115)","v":25000},"Passiva",{"$f":"D117","v":25000}]
[]
[null,null,"Schuldzinsen"]
[null,null,"Bezahlung Schuldzinsen",{"$f":"BUCHUNGSSÄTZE!H14","v":1100}]
[null,null,{"$f":"IF(D121=\"\",\"\",IF(D121=\"---------------\",\"------------------------------------------------\",\"Saldo\"))","v":""},{"$f":"IF(SUM(F120)-SUM(D120)<0,\"\",IF(SUM(F120)=SUM(D120),\"---------------\",SUM(F120)-SUM(D120)))","v":""},{"$f":"IF(F121=\"\",\"\",IF(F121=\"---------------\",\"------------------------------------------------\",\"Saldo\"))","v":"Saldo"},{"$f":"IF(SUM(D120)-SUM(F120)<0,\"\",IF(SUM(D120)=SUM(F120),\"---------------\",SUM(D120)-SUM(F120)))","v":1100}]
[null,null,"Aktiva",{"$f":"SUM(D120)","v":1100},"Passiva",{"$f":"D122","v":1100}]
[]
[null,null,"Strom"]
[null,null,"Bezahlung Stromrechnung",{"$f":"BUCHUNGSSÄTZE!H17","v":1850},"Privatanteil (Strom)",{"$f":"BUCHUNGSSÄTZE!H27","v":370}]
[null,null,{"$f":"IF(D126=\"\",\"\",IF(D126=\"---------------\",\"------------------------------------------------\",\"Saldo\"))","v":""},{"$f":"IF(SUM(F125)-SUM(D125)<0,\"\",IF(SUM(F125)=SUM(D125),\"---------------\",SUM(F125)-SUM(D125)))","v":""},{"$f":"IF(F126=\"\",\"\",IF(F126=\"---------------\",\"------------------------------------------------\",\"Saldo\"))","v":"Saldo"},{"$f":"IF(SUM(D125)-SUM(F125)<0,\"\",IF(SUM(D125)=SUM(F125),\"---------------\",SUM(D125)-SUM(F125)))","v":1480}]
[null,null,"Aktiva",{"$f":"SUM(D125:D126)","v":1850},"Passiva",{"$f":"D127","v":1850}]
[]
[null,null,"Abschreibung (AfA)"]
[null,null,"AfA (Wirtschaftsgebäude)",{"$f":"BUCHUNGSSÄTZE!H22","v":11300}]
[null,null,"Afa (Maschinen)",{"$f":"BUCHUNGSSÄTZE!H23","v":6799.666666666667}]
[null,null,{"$f":"IF(D132=\"\",\"\",IF(D132=\"---------------\",\"------------------------------------------------\",\"Saldo\"))","v":""},{"$f":"IF(SUM(F130:F131)-SUM(D130:D131)<0,\"\",IF(SUM(F130:F131)=SUM(D130:D131),\"---------------\",SUM(F130:F131)-SUM(D130:D131)))","v":""},{"$f":"IF(F132=\"\",\"\",IF(F132=\"---------------\",\"------------------------------------------------\",\"Saldo\"))","v":"Saldo"},{"$f":"IF(SUM(D130:D131)-SUM(F130:F131)<0,\"\",IF(SUM(D130:D131)=SUM(F130:F131),\"---------------\",SUM(D130:D131)-SUM(F130:F131)))","v":18099.666666666668}]
[null,null,"Aktiva",{"$f":"SUM(D130:D131)","v":18099.666666666668},"Passiva",{"$f":"D133","v":18099.666666666668}]
[]
[null,null,"Ertragskonten"]
[null,null,"Milchviehhaltung"]
[null,null,null,null,"Einnahmen Milchviehhaltung",{"$f":"BUCHUNGSSÄTZE!H9","v":44125}]
[null,null,null,null,"Naturallieferung (Milch)",{"$f":"BUCHUNGSSÄTZE!H31","v":165}]
[null,null,{"$f":"IF(D139=\"\",\"\",IF(D139=\"---------------\",\"------------------------------------------------\",\"Saldo\"))","v":"Saldo"},{"$f":"IF(SUM(F137:F138)-SUM(D137:D138)<0,\"\",IF(SUM(F137:F138)=SUM(D137:D138),\"---------------\",SUM(F137:F138)-SUM(D137:D138)))","v":44290},{"$f":"IF(F139=\"\",\"\",IF(F139=\"---------------\",\"------------------------------------------------\",\"Saldo\"))","v":""},{"$f":"IF(SUM(D137:D138)-SUM(F137:F138)<0,\"\",IF(SUM(D137:D138)=SUM(F137:F138),\"---------------\",SUM(D137:D138)-SUM(F137:F138)))","v":""}]
[null,null,"Aktiva",{"$f":"F140","v":44290},"Passiva",{"$f":"SUM(F137:F138)","v":44290}]
[]
[null,null,"Urlaub am Bauernhof"]
[null,null,null,null,"Einnahmen UaB",{"$f":"BUCHUNGSSÄTZE!H12","v":25000}]
[null,null,{"$f":"IF(D144=\"\",\"\",IF(D144=\"---------------\",\"------------------------------------------------\",\"Saldo\"))","v":"Saldo"},{"$f":"IF(SUM(F143)-SUM(D143)<0,\"\",IF(SUM(F143)=SUM(D143),\"---------------\",SUM(F143)-SUM(D143)))","v":25000},{"$f":"IF(F144=\"\",\"\",IF(F144=\"---------------\",\"------------------------------------------------\",\"Saldo\"))","v":""},{"$f":"IF(SUM(D143)-SUM(F143)<0,\"\",IF(SUM(D143)=SUM(F143),\"---------------\",SUM(D143)-SUM(F143)))","v":""}]
[null,null,"Aktiva",{"$f":"F145","v":25000},"Passiva",{"$f":"SUM(F143)","v":25000}]
[]
[null,null,"Mastvieh"]
[null,null,null,null,"Mastviehverkauf",{"$f":"BUCHUNGSSÄTZE!H15","v":7450}]
[null,null,{"$f":"IF(BUCHUNGSSÄTZE!E35=\"Minderwert Viehvermögen\",\"Minderwert Viehvermögen\",\"\")","v":"Minderwert Viehvermögen"},{"$f":"IF(BUCHUNGSSÄTZE!E35=\"Minderwert Viehvermögen\",BUCHUNGSSÄTZE!H35,\"\")","v":1550},{"$f":"IF(BUCHUNGSSÄTZE!E35=\"Mehrwert Viehvermögen\",\"Mehrwert Viehvermögen\",\"\")","v":""},{"$f":"IF(BUCHUNGSSÄTZE!E35=\"Mehrwert Viehvermögen\",BUCHUNGSSÄTZE!H35,\"\")","v":""}]
[null,null,{"$f":"IF(D150=\"\",\"\",IF(D150=\"---------------\",\"------------------------------------------------\",\"Saldo\"))","v":"Saldo"},{"$f":"IF(SUM(F148:F149)-SUM(D148:D149)<0,\"\",IF(SUM(F148:F149)=SUM(D148:D149),\"---------------\",SUM(F148:F149)-SUM(D148:D149)))","v":5900},{"$f":"IF(F150=\"\",\"\",IF(F150=\"---------------\",\"------------------------------------------------\",\"Saldo\"))","v":""},{"$f":"IF(SUM(D148:D149)-SUM(F148:F149)<0,\"\",IF(SUM(D148:D149)=SUM(F148:F149),\"---------------\",SUM(D148:D149)-SUM(F148:F149)))","v":""}]
[null,null,"Aktiva",{"$f":"F151","v":7450},"Passiva",{"$f":"SUM(F148:F150)","v":7450}]
[]
[null,null,"Privatkonto"]
[null,null,"Privat"]
[null,null,"Privatausgaben Haushalt",{"$f":"BUCHUNGSSÄTZE!H10","v":22150},"Familienbeihilfe",{"$f":"BUCHUNGSSÄTZE!H11","v":650}]
[null,null,"Strom Privat",{"$f":"BUCHUNGSSÄTZE!H27","v":370}]
[null,null,"Naturallieferung",{"$f":"BUCHUNGSSÄTZE!H31","v":165}]
[null,null,{"$f":"IF(D158=\"\",\"\",IF(D158=\"---------------\",\"------------------------------------------------\",\"Saldo\"))","v":""},{"$f":"IF(SUM(F155:F157)-SUM(D155:D157)<0,\"\",IF(SUM(F155:F157)=SUM(D155:D157),\"---------------\",SUM(F155:F157)-SUM(D155:D157)))","v":""},{"$f":"IF(F158=\"\",\"\",IF(F158=\"---------------\",\"------------------------------------------------\",\"Saldo\"))","v":"Saldo"},{"$f":"IF(SUM(D155:D157)-SUM(F155:F157)<0,\"\",IF(SUM(D155:D157)=SUM(F155:F157),\"---------------\",SUM(D155:D157)-SUM(F155:F157)))","v":22035}]
[null,null,"Aktiva",{"$f":"SUM(D155:D157)","v":22685},"Passiva",{"$f":"D159","v":22685}]

{"sheet":"Ber.BILAN","index":3,"n_rows":43,"n_cols":7,"rows_kept":43,"cut":false,"hidden":false,"merged":[[2,2,2,9],[14,2,14,9],[29,6,30,6],[29,7,30,7],[5,3,6,3],[5,6,6,6],[5,7,6,7],[5,5,6,5],[10,3,11,3],[10,5,11,5],[10,6,11,6],[10,7,11,7],[17,3,18,3],[17,5,18,5],[17,6,18,6],[17,7,18,7],[23,2,23,9],[24,2,24,9],[25,2,25,9],[34,2,34,9],[42,2,42,9],[37,3,38,3],[37,5,38,5],[37,6,38,6],[37,7,38,7],[29,3,30,3],[29,5,30,5]]}
[null,null,"Bilanzanalyse"]
[]
[null,null,"Die Bilanzanalyse liefert wertvolle Auskünfte hinsichtlich der finanzwirtschaftlichen Situation des Betriebs bzw. Unternehmens. Bei Vergleichen zwischen Betrieben muss darauf geachtet werden, dass die Posten der Bilanz einheitlich bewertet wurden (wichtig vor allem beim Boden oder dem stehenden Holz)."]
[]
[null,null,"Eigenkapitalanteil (31.12.)"]
[null,null,"Eigenkapital","=",null,"x 100","="]
[null,null,"Gesamtkapital"]
[]
[]
[null,null,"Verschuldungsgrad  (31.12.)"]
[null,null,"Fremdkapital","=",null,"x 100","="]
[null,null,"Gesamtkapital"]
[]
[]
[null,null,"Je höher der Eigenkapitalanteil und je niedriger der Verschuldungsgrad, desto geringer ist die Abhängigkeit eines landwirtschaftlichen Betriebs von Kreditgebern und desto vorsichtiger wurde finanziert. "]
[]
[null,null,"Anlagenintensität  (31.12.)"]
[null,null,"Anlagevermögen1","=",null,"x 100","="]
[null,null,"Gesamtvermögen"]
[null,null,"1 Wirtschaftsgebäude sowie Maschinen und Geräte"]
[]
[]
[null,null,"Für einen landwirtschaftlichen Betrieb gilt:"]
[null,null,"Je höher die Anlagenintensität, desto mehr ist er in seinem Aufbau gebunden, umso stärker ist die Belastung mit Fixkosten. "]
[null,null,"Je höher die Anlagenintensität, desto langsamer setzt er das Vermögen um, die Verzinsung des Vermögens ist meist gering."]
[null,null,"Die relative Erhöhung der Anlagenintensität kann sich jedoch auch aus Einsparungen beim Umlaufvermögen ergeben.   "]
[]
[]
[null,null,"Goldene Bilanzregel im engeren Sinn (31.12.)"]
[null,null,"EK + langfrist. FK2","=",null,"x 100","="]
[null,null,"Anlagenvermögen (AV)"]
[null,null,"2 EK = Eigenkapital, FK = Fremdkapital"]
[]
[]
[null,null,"Die „goldene Bilanzregel“ im engeren Sinne besagt, dass das Anlagevermögen langfristig zu finanzieren ist."]
[]
[null,null,"Goldene Bilanzregel im weiteren Sinn (31.12.)"]
[null,null,"EK + langfrist. FK","=",null,"x 100","="]
[null,null,"AV + gebundenes UV3"]
[null,null,"3 gebundenes Umlaufvermögen (UV): Viehvermögen und Vorräte"]
[]
[]
[null,null,"Als „goldene Bilanzregel“ im weiteren Sinne wird der Grundsatz bezeichnet, dass das Anlage- und das gebundene Umlaufvermögen zusammen langfristig finanziert werden sollen:"]

{"sheet":"Ber.RENT","index":4,"n_rows":56,"n_cols":10,"rows_kept":56,"cut":false,"hidden":false,"merged":[[22,3,22,6],[13,3,14,3],[13,5,14,5],[13,6,14,6],[50,3,51,3],[50,5,51,5],[50,6,51,6],[19,2,19,8],[50,7,51,7],[29,3,29,6],[42,3,43,3],[42,5,43,5],[42,6,43,6],[42,7,43,7],[47,2,47,9],[55,2,55,9],[2,2,2,9],[8,2,8,9],[9,2,9,9],[10,2,10,9],[17,2,17,9],[39,2,39,9],[13,7,14,7],[28,3,28,4],[27,3,27,4],[33,3,33,6],[35,3,35,6],[34,3,34,6],[5,4,5,5],[21,3,21,6],[20,3,20,6]]}
[null,null,"Analyse der Rentabilität"]
[]
[null,null,"Die Analyse der Rentabilität ermittelt den Ertrag der eingesetzten Produktionsfaktoren „Arbeit“ und „Kapital“ im Vergleich zum benötigten Aufwand."]
[]
[null,null,"Einkünfte aus Land- und Forstwirtschaft"]
[null,null,{"$f":"+BUCHFÜHRUNG!F32","v":75190},"-",{"$f":"+SUM(BUCHFÜHRUNG!D25:D30)","v":50179.666666666664},null,"="]
[]
[]
[null,null,"Die Einkünfte stellen"]
[null,null,"die Abgeltung für die geleistete Arbeit der nicht entlohnten Arbeitskräfte für die unternehmerische Tätigkeit und "]
[null,null,"die Verzinsung für den Einsatz des Eigenkapitals dar.  "]
[]
[null,null,"Gewinnrate"]
[null,null,"Einkünfte LuF","=",null,"x 100","="]
[null,null,"Ertrag"]
[]
[]
[null,null,"Je höher die Gewinnrate eines Unternehmens, desto effizienter arbeitet es und umso leichter können Krisenzeiten bei sinkenden Erzeugerpreisen überstanden werden. "]
[]
[null,null,{"$f":"BUCHFÜHRUNG!D49/100","v":3.5000000000000003E-2}]
[null,null,null," Gewinn"]
[null,null,{"$f":"-BUCHFÜHRUNG!F15*C20","v":-6580.8726666666662},"Zinsansatz Eigenkapital*"]
[null,null,null,"Arbeitsverdienst"]
[null,null,{"$f":"\"* \"&TEXT(BUCHFÜHRUNG!F15,\"# ##0\")&\" Euro mal Zinssatz von \"&C20*100&\"%\"","v":"* 188 025 Euro mal Zinssatz von 3,5%"}]
[]
[]
[null,null,"Vermögensrente"]
[null,null,null," Gewinn"]
[null,null,{"$f":"-BUCHFÜHRUNG!D48","v":-21297},"Lohnansatz"]
[null,null,null,"Vermögensrente"]
[]
[]
[null,null,"Unternehmergewinn"]
[null,null,null," Gewinn"]
[null,null,{"$f":"+C22","v":-6580.8726666666662},"Zinsansatz Eigenkapital"]
[null,null,{"$f":"+C29","v":-21297},"Lohnansatz"]
[null,null,null,"Unternehmergewinn (-verlust)"]
[]
[]
[null,null,"Der Unternehmergewinn bzw. Unternehmerverlust informiert über die Entlohnung der unternehmerischen Leistung, wenn vom Gewinn sowohl der Lohn- als auch der Zinsansatz abgezogen sind."]
[]
[null,null,"Eigenkapitalrentabiliät"]
[null,null,"Einkünfte LuF - LA","=",null,"x 100","="]
[null,null,"Eigenkapital"]
[null,null,"LA = Lohnansatz (siehe oben!)"]
[]
[]
[null,null,"Vom Gewinn wird der Lohnansatz für die nicht entlohnten Arbeitskräfte abzogen, die resultierende Differenz wird durch das betrieblich gebundene Eigenkapital dividiert. "]
[]
[null,null,"Gesamtkapitalrentabilität",null,null,null,null,null,null,"ROI"]
[null,null,"Einkünfte LuF + SZ - LA","=",null,"x 100","="]
[null,null,"Gesamtkapital"]
[null,null,"LA = Lohnansatz (siehe oben!), SZ = Schuldzinsen (siehe Buchführung!)"]
[]
[]
[null,null,"Schulden sind Bestandteil des Gesamtkapitals, deshalb werden die Schuldzinsen wieder hinzugerechnet (diese wurden im Aufwand zur Ermittlung der Einkünfte aus LuF)."]

{"sheet":"Ber.FIN","index":5,"n_rows":57,"n_cols":5,"rows_kept":57,"cut":false,"hidden":false,"merged":[[4,0,4,10],[21,0,21,10],[56,0,56,10],[53,0,53,3],[38,0,38,1],[33,2,33,3],[39,0,39,2],[42,0,42,2],[45,0,45,2],[48,0,48,2],[52,0,52,2],[54,0,54,2]]}
[]
[]
["Analyse der Finanzierungskraft"]
[]
["Die Analyse der Finanzierungskraft meint im Wesentlichen die Gegenüberstellung von Einnahmen und Ausgaben. Die Änderungen des Geldbereichs sollen die Finanzierungskraft aus Eigenmitteln veranschaulichen. Als Kennzahlen bzw. Methoden haben sich in diesem Zusammenhang der Cash-Flow sowie die Kapitalflussrechnung etabliert."]
[]
["Cash Flow"]
[]
["Bezeichnung","Euro","Euro gesamt"]
["Einkünfte LuF",{"$f":"+BUCHFÜHRUNG!D31","v":25010.333333333336},null,"Einkünfte LuF laut GuV"]
["- Naturallieferung Milch",{"$f":"+BUCHFÜHRUNG!F138","v":165},null,"Ist ein Ertrag, aber keine Einnahme"]
["+ Minderung Viehvermögen",{"$f":"+BUCHFÜHRUNG!D148","v":0},null,"Ist ein Aufwand, aber sind keine Ausgaben"]
["+ Abschreibungen",{"$f":"+BUCHFÜHRUNG!D130+BUCHFÜHRUNG!D131","v":18099.666666666668},null,"Ist ein Aufwand, aber sind keine Ausgaben"]
["= Cash Flow I"]
["- Investitionen",{"$f":"+BUCHFÜHRUNG!D60","v":25000},null,"Kauf eines Ladewagens"]
["- Kreditrückzahlungen",{"$f":"+BUCHFÜHRUNG!D98","v":8500},null,"Tilgung"]
["= Cash Flow II"]
["+ Einlagen",{"$f":"+BUCHFÜHRUNG!F155","v":650},null,"Familienbeihilfe"]
["- Entnahmen",{"$f":"+BUCHFÜHRUNG!D155+BUCHFÜHRUNG!D156","v":22520},null,"Ausgaben für den Haushalt plus private Stromausgaben"]
["= Cash Flow III"]
[]
["Der Cash-Flow stellt die Einnahmen und Ausgaben eines Unternehmens während eines Jahres gegenüber. Ausgehend von der Gewinn- und Verlustrechnung errechnet sich der Cash-Flow I, indem vom Gewinn die Abschreibungen und Minderwerte hinzugerechnet und die Mehrwerte abgezogen werden. Vom Cash-Flow I werden Ausgaben für Investitionen sowie Tilgungen für Kredite abgezogen, als Ergebnis wird der Cash-Flow II ausgewiesen. Der Cash-Flow III errechnet sich, indem vom Cash-Flow II die Einlagen hinzu- und die Entnahmen des Privatbereichs abgezogen werden. Der erhaltene Betrag wird auch als Free Cash-Flow ohne Fremdfinanzierung oder als Geldüberschuss bezeichnet."]
[]
[]
[]
["Analyse der Finanzierungskraft"]
[]
["Kapitalflussrechnung"]
[]
["Bezeichnung","Mittel-\nherkunft","Mittel-verwendung","Differenz"]
["Milchverkauf",{"$f":"+BUCHFÜHRUNG!F137","v":44125},null,null,"Nur Milchverkauf ohne Naturallierung an Haushalt"]
["Urlaub am Bauernhof",{"$f":"+BUCHFÜHRUNG!F143","v":25000},null,null,"Einnahmen Urlaub am Bauernhof"]
["Rinderverkauf",{"$f":"+BUCHFÜHRUNG!F148","v":7450},null,null,"Bestandesminderungen werden nicht berücksichtigt; sind keine Ausgaben, nur Aufwand"]
["Summe Einnahmen"]
["Dünger",{"$f":"-BUCHFÜHRUNG!D110","v":-4500},{"$f":"+BUCHFÜHRUNG!F111","v":4500},null,"Aufwand für Dünger"]
["Diverse Betriebsmittel",{"$f":"-BUCHFÜHRUNG!D115","v":-25000},{"$f":"+BUCHFÜHRUNG!F116","v":25000},null,"Aufwand für diverse Betriebsmittel"]
["Schuldzinsen",{"$f":"-BUCHFÜHRUNG!D120","v":-1100},{"$f":"+BUCHFÜHRUNG!F121","v":1100},null,"Aufwand für Schuldzinsen"]
["Strom",{"$f":"-BUCHFÜHRUNG!F126","v":-1480},{"$f":"+BUCHFÜHRUNG!F126","v":1480},null,"Nur betrieblicher Strom (Privatanteil ist abgezogen)"]
["Summe Ausgaben"]
["Umsatzbereich"]
["Desinvestitionen",0,null,null,"Keine Verkäufe von Anlagen"]
["Investitionen",null,{"$f":"+BUCHFÜHRUNG!D60","v":25000},null,"Kauf eines Ladewagens"]
["Anlagenbereich"]
["Kreditaufnahme",0,null,null,"Keine Aufnahme neuer Kredit"]
["Kreditrückzahlung",null,{"$f":"+BUCHFÜHRUNG!D98","v":8500},null,"Tilgung"]
["Fremdkapitalbereich"]
["Einlagen",{"$f":"+BUCHFÜHRUNG!F155","v":650},null,null,"Familienbeihilfe"]
["Entnahmen",null,{"$f":"+BUCHFÜHRUNG!D155+BUCHFÜHRUNG!D156","v":22520},null,"Ausgaben für den Haushalt plus private Stromausgaben"]
["Privatbereich"]
["Erhalt Forderungen",{"$f":"+BUCHFÜHRUNG!D85","v":14800},null,null,"Offene Forderung wurde an uns gezahlt"]
["Zunahme Girokonto",null,{"$f":"+BUCHFÜHRUNG!F87-BUCHFÜHRUNG!D81","v":1075},null,"Endbestand minus Anfangsbestand"]
["Zunahme Kassa",null,{"$f":"+BUCHFÜHRUNG!F93-BUCHFÜHRUNG!D91","v":2850},null,"Endbestand minus Anfangsbestand"]
["Geldbereich"]
[]
["Kontrollsumme",null,null,{"$f":"+D40+D43+D46+D49+D53","v":0},"Kontrollsumme muss 0 sein!"]
[]
["Die Kapitalflussrechnung stellt eine Bewegungsrechnung dar, die für einen bestimmten Zeitraum Herkunft und Verwendung verschiedener, liquiditätswirksamer Mittel gegenüberstellt. Die Beträge werden nach Mittelherkunft und Mittelverwendung getrennt."]

{"sheet":"Ber.STAB","index":6,"n_rows":50,"n_cols":7,"rows_kept":50,"cut":false,"hidden":false,"merged":[[12,5,13,5],[12,6,13,6],[12,7,13,7],[5,4,5,5],[2,2,2,9],[12,3,13,3],[31,2,31,9],[46,2,46,9],[17,3,18,3],[17,5,18,5],[17,6,18,6],[17,7,18,7],[21,2,21,9]]}
[null,null,"Analyse der Stabilität"]
[]
[null,null,"Stabilität wird definiert als die Fähigkeit eines Unternehmens, Rentabilität und Liquidität auch bei Eintritt unvorhergesehener Ereignisse langfristig zu sichern."]
[]
[null,null,"Fremdkapitalanteil"]
[null,null,"siehe Bilanzanalyse"]
[]
[null,null,"Anlagenintensität"]
[null,null,"siehe Bilanzanalyse"]
[]
[null,null,"Veralterungsgrad von abnutzbarem Anlagevermögen"]
[null,null,"Gebäude und bauliche Anlagen"]
[null,null,"Buchwert (31.12.)","=",null,"x 100","="]
[null,null,"Summe Anschaffungswert"]
[]
[]
[null,null,"Maschinen und Geräte"]
[null,null,"Buchwert (31.12.)","=",null,"x 100","="]
[null,null,"Summe Anschaffungswert"]
[]
[]
[null,null,"Je niedriger der Veralterungsgrad, desto älter sind die Anlagengüter, das heißt, desto größer ist der Investitionsrückstand, sofern die Nutzungsdauer richtig eingeschätzt wurde. In einer ersten Näherung könnte die Aussage getroffen werden, dass bei einer Relation von Buchwert zu Anschaffungswert gleich 0,5 der Betrieb kontinuierlich investiert hat. Dies gilt aber streng genommen nur dann, wenn eine Inflationsrate von null Prozent vorläge. "]
[]
[null,null,"Eigenkapitalveränderung"]
[null,null,"Einkünfte aus LuF",null,{"$f":"+BUCHFÜHRUNG!D31","v":25010.333333333336}]
[null,null,"+ Einlagen",null,{"$f":"+BUCHFÜHRUNG!F35","v":650},"Familienbeihilfe"]
[null,null,"= Gesamt(Haushalts)einkommen",null,{"$f":"+E25+E26","v":25660.333333333336}]
[null,null,"- Verbrauch",null,{"$f":"+BUCHFÜHRUNG!D35+BUCHFÜHRUNG!D36+BUCHFÜHRUNG!D37","v":22685},"Privatentnahmen *"]
[null,null,"= Eigenkapitalveränderung",null,null,"**"]
[]
[]
[null,null,"Die Höhe der Eigenkapitalveränderung informiert darüber, inwieweit der Gewinn und die Einlagen ausgereicht haben, die Entnahmen abzudecken. Eine positive Eigenkapitalveränderung ist deshalb erforderlich, da wegen der Inflation die zurückgelegten Abschreibungen für eine Ersatzinvestition nicht ausreichen. Die Eigenkapitalveränderung muss daher die Differenz aus Wiederbeschaffungswert und ursprünglichem Anschaffungswert abdecken. "]
[]
[]
[]
[]
[null,null,"Kapitaldienstgrenze"]
[null,null,"Bezeichnung",null,"Euro"]
[null,null,"Eigenkapitalveränderung",null,{"$f":"IF(E29=\"\",\"noch leer\",+E29)","v":"noch leer"}]
[null,null,"+ gezahlte Schuldzinsen",null,{"$f":"+BUCHFÜHRUNG!D27","v":1100}]
[null,null,"= langfristige Kapitaldienstgrenze"]
[null,null,"+ AfA Gebäude",null,{"$f":"+BUCHFÜHRUNG!D130","v":11300}]
[null,null,"= mittelfristige Kapitaldienstgrenze"]
[null,null,"+ AfA Maschinen",null,{"$f":"+BUCHFÜHRUNG!D131","v":6799.666666666667}]
[null,null,"= kurzfristige Kapitaldienstgrenze"]
[]
[null,null,"Die langfristige Kapitaldienstgrenze drückt aus, wie viel maximal für Zinsen und Tilgung (=Kapitaldienst) bereits bestehender und zusätzlicher Kredite maximal zur Verfügung steht. Deshalb werden zur Eigenkapitalveränderung auch die gezahlten Schuldzinsen, die bereits im Aufwand enthalten waren, hinzugezählt. Bei der mittelfristigen Kapitaldienstgrenze werden auch die Abschreibungen für Gebäude und bauliche Anlagen, Bodenverbesserungen und Dauerkulturen dazugezählt. Bei der kurzfristigen Kapitaldienstgrenze sind noch die Abschreibungen für Maschinen und Geräte berücksichtigt. "]
[]
[null,null,"* Ausgaben Haushalt, Strom Privatanteil, Naturallieferung Milch"]
[null,null,"** Auch Überdeckung des Verbrauchs genannt"]

{"sheet":"Korrektur","index":7,"n_rows":98,"n_cols":14,"rows_kept":98,"cut":false,"hidden":false,"merged":[[95,6,95,8],[97,4,97,5],[1,2,1,9],[6,11,6,13],[86,4,86,9]]}
[null,null,"Korrekturblatt - Kennzahlenanalyse"]
[null,null,null,null,null,null,null,null,null,null,null,null,null,{"$f":"IF(F96>J96,\"Du musst zuerst alle Berechnungen durchführen, um das                                     Ergebnis ansehen zu können!\",\"\")","v":"Du musst zuerst alle Berechnungen durchführen, um das                                     Ergebnis ansehen zu können!"}]
[null,null,null," unabhängige Ergebnisse"]
[]
[null,null,null," abhängige Ergebnisse (werden wenn die Formel korrekt ist, als Folgefehler mit 0,5 Punkten bewertet)"]
[]
[null,null,null,null,null,"Ergebnis",null,"Formel-\nprüfung",null,"Deine Be-rechnung",{"$f":"\"Fehler\"","v":"Fehler"},"Punkte"]
[null,null,"1.","Bilanzanalyse"]
[null,null,null,"Eigenkapital",null,{"$f":"IF(Hilfe.BILAN!E6=\"\",\"\",Hilfe.BILAN!E6)","v":188024.93333333329},null,"-",null,{"$f":"IF(Ber.BILAN!E6=\"\",\"\",Ber.BILAN!E6)","v":""},{"$f":"IF(J9=F9,\"Richtig!\",IF(J9=\"\",\"Fehlt\",\"Falsch\"))","v":"Fehlt"},{"$f":"IF(K9=\"Richtig!\",1,IF(K9=\"Formel: OK\",0.5,IF(OR(K9=\"Falsch\",K9=\"Fehlt\"),0,\"\")))","v":0},"│",1]
[null,null,null,"Gesamtkapital",null,{"$f":"IF(Hilfe.BILAN!E7=\"\",\"\",Hilfe.BILAN!E7)","v":269524.93333333329},null,null,null,{"$f":"IF(Ber.BILAN!E7=\"\",\"\",Ber.BILAN!E7)","v":""},{"$f":"IF(J10=F10,\"Richtig!\",IF(J10=\"\",\"Fehlt\",\"Falsch\"))","v":"Fehlt"},{"$f":"IF(K10=\"Richtig!\",1,IF(K10=\"Formel: OK\",0.5,IF(OR(K10=\"Falsch\",K10=\"Fehlt\"),0,\"\")))","v":0},"│",1]
[null,null,null,"Eigenkapitalanteil (31.12.)",null,{"$f":"IF(Hilfe.BILAN!H6=\"\",\"\",Hilfe.BILAN!H6)","v":0.69761610181272027},null,{"$f":"IF(OR(J9=\"\",J10=\"\"),\"-\",J9/J10)","v":"-"},null,{"$f":"IF(Ber.BILAN!H6=\"\",\"\",Ber.BILAN!H6)","v":""},{"$f":"IF(J11=F11,\"Richtig!\",IF(AND(H11<>\"\",J11<>F11,J11=H11),\"Formel: OK\",IF(J11=\"\",\"Fehlt\",\"Falsch\")))","v":"Fehlt"},{"$f":"IF(K11=\"Richtig!\",1,IF(K11=\"Formel: OK\",0.5,IF(OR(K11=\"Falsch\",K11=\"Fehlt\"),0,\"\")))","v":0},"│",1]
[]
[null,null,null,"Fremdkapital",null,{"$f":"IF(Hilfe.BILAN!E11=\"\",\"\",Hilfe.BILAN!E11)","v":81500},null,"-",null,{"$f":"IF(Ber.BILAN!E11=\"\",\"\",Ber.BILAN!E11)","v":""},{"$f":"IF(J13=F13,\"Richtig!\",IF(J13=\"\",\"Fehlt\",\"Falsch\"))","v":"Fehlt"},{"$f":"IF(K13=\"Richtig!\",1,IF(K13=\"Formel: OK\",0.5,IF(OR(K13=\"Falsch\",K13=\"Fehlt\"),0,\"\")))","v":0},"│",1]
[null,null,null,"Gesamtkapital",null,{"$f":"IF(Hilfe.BILAN!E12=\"\",\"\",Hilfe.BILAN!E12)","v":269524.93333333329},null,null,null,{"$f":"IF(Ber.BILAN!E12=\"\",\"\",Ber.BILAN!E12)","v":""},{"$f":"IF(J14=F14,\"Richtig!\",IF(J14=\"\",\"Fehlt\",\"Falsch\"))","v":"Fehlt"},{"$f":"IF(K14=\"Richtig!\",1,IF(K14=\"Formel: OK\",0.5,IF(OR(K14=\"Falsch\",K14=\"Fehlt\"),0,\"\")))","v":0},"│",1]
[null,null,null,"Verschulungsgrad (31.12.)",null,{"$f":"IF(Hilfe.BILAN!H11=\"\",\"\",Hilfe.BILAN!H11)","v":0.30238389818727968},null,{"$f":"IF(OR(J13=\"\",J14=\"\"),\"-\",J13/J14)","v":"-"},null,{"$f":"IF(Ber.BILAN!H11=\"\",\"\",Ber.BILAN!H11)","v":""},{"$f":"IF(J15=F15,\"Richtig!\",IF(AND(H15<>\"\",J15<>F15,J15=H15),\"Formel: OK\",IF(J15=\"\",\"Fehlt\",\"Falsch\")))","v":"Fehlt"},{"$f":"IF(K15=\"Richtig!\",1,IF(K15=\"Formel: OK\",0.5,IF(OR(K15=\"Falsch\",K15=\"Fehlt\"),0,\"\")))","v":0},"│",1]
[]
[null,null,null,"Anlagevermögen",null,{"$f":"IF(Hilfe.BILAN!E18=\"\",\"\",Hilfe.BILAN!E18)","v":229800.33333333331},null,"-",null,{"$f":"IF(Ber.BILAN!E18=\"\",\"\",Ber.BILAN!E18)","v":""},{"$f":"IF(J17=F17,\"Richtig!\",IF(J17=\"\",\"Fehlt\",\"Falsch\"))","v":"Fehlt"},{"$f":"IF(K17=\"Richtig!\",1,IF(K17=\"Formel: OK\",0.5,IF(OR(K17=\"Falsch\",K17=\"Fehlt\"),0,\"\")))","v":0},"│",1]
[null,null,null,"Gemtvermögen",null,{"$f":"IF(Hilfe.BILAN!E19=\"\",\"\",Hilfe.BILAN!E19)","v":269524.93333333329},null,null,null,{"$f":"IF(Ber.BILAN!E19=\"\",\"\",Ber.BILAN!E19)","v":""},{"$f":"IF(J18=F18,\"Richtig!\",IF(J18=\"\",\"Fehlt\",\"Falsch\"))","v":"Fehlt"},{"$f":"IF(K18=\"Richtig!\",1,IF(K18=\"Formel: OK\",0.5,IF(OR(K18=\"Falsch\",K18=\"Fehlt\"),0,\"\")))","v":0},"│",1]
[null,null,null,"Anlagenintensität (31.12.)",null,{"$f":"IF(Hilfe.BILAN!H18=\"\",\"\",Hilfe.BILAN!H18)","v":0.85261252267570053},null,{"$f":"IF(OR(J17=\"\",J18=\"\"),\"-\",J17/J18)","v":"-"},null,{"$f":"IF(Ber.BILAN!H18=\"\",\"\",Ber.BILAN!H18)","v":""},{"$f":"IF(J19=F19,\"Richtig!\",IF(AND(H19<>\"\",J19<>F19,J19=H19),\"Formel: OK\",IF(J19=\"\",\"Fehlt\",\"Falsch\")))","v":"Fehlt"},{"$f":"IF(K19=\"Richtig!\",1,IF(K19=\"Formel: OK\",0.5,IF(OR(K19=\"Falsch\",K19=\"Fehlt\"),0,\"\")))","v":0},"│",1]
[]
[null,null,null,"EK + langfrist. FK",null,{"$f":"IF(Hilfe.BILAN!E30=\"\",\"\",Hilfe.BILAN!E30)","v":269524.93333333329},null,"-",null,{"$f":"IF(Ber.BILAN!E30=\"\",\"\",Ber.BILAN!E30)","v":""},{"$f":"IF(J21=F21,\"Richtig!\",IF(J21=\"\",\"Fehlt\",\"Falsch\"))","v":"Fehlt"},{"$f":"IF(K21=\"Richtig!\",1,IF(K21=\"Formel: OK\",0.5,IF(OR(K21=\"Falsch\",K21=\"Fehlt\"),0,\"\")))","v":0},"│",1]
[null,null,null,"Anlagenvermögen (AV)",null,{"$f":"IF(Hilfe.BILAN!E31=\"\",\"\",Hilfe.BILAN!E31)","v":229800.33333333331},null,null,null,{"$f":"IF(Ber.BILAN!E31=\"\",\"\",Ber.BILAN!E31)","v":""},{"$f":"IF(J22=F22,\"Richtig!\",IF(J22=\"\",\"Fehlt\",\"Falsch\"))","v":"Fehlt"},{"$f":"IF(K22=\"Richtig!\",1,IF(K22=\"Formel: OK\",0.5,IF(OR(K22=\"Falsch\",K22=\"Fehlt\"),0,\"\")))","v":0},"│",1]
[null,null,null,"Goldene Bilanzregel im engeren Sinn (31.12.)",null,{"$f":"IF(Hilfe.BILAN!H30=\"\",\"\",Hilfe.BILAN!H30)","v":1.1728657196609811},null,{"$f":"IF(OR(J21=\"\",J22=\"\"),\"-\",J21/J22)","v":"-"},null,{"$f":"IF(Ber.BILAN!H30=\"\",\"\",Ber.BILAN!H30)","v":""},{"$f":"IF(J23=F23,\"Richtig!\",IF(AND(H23<>\"\",J23<>F23,J23=H23),\"Formel: OK\",IF(J23=\"\",\"Fehlt\",\"Falsch\")))","v":"Fehlt"},{"$f":"IF(K23=\"Richtig!\",1,IF(K23=\"Formel: OK\",0.5,IF(OR(K23=\"Falsch\",K23=\"Fehlt\"),0,\"\")))","v":0},"│",1]
[]
[null,null,null,"EK + langfrist. FK",null,{"$f":"IF(Hilfe.BILAN!E38=\"\",\"\",Hilfe.BILAN!E38)","v":269524.93333333329},null,"-",null,{"$f":"IF(Ber.BILAN!E38=\"\",\"\",Ber.BILAN!E38)","v":""},{"$f":"IF(J25=F25,\"Richtig!\",IF(J25=\"\",\"Fehlt\",\"Falsch\"))","v":"Fehlt"},{"$f":"IF(K25=\"Richtig!\",1,IF(K25=\"Formel: OK\",0.5,IF(OR(K25=\"Falsch\",K25=\"Fehlt\"),0,\"\")))","v":0},"│",1]
[null,null,null,"AV + gebundenes UV",null,{"$f":"IF(Hilfe.BILAN!E39=\"\",\"\",Hilfe.BILAN!E39)","v":263049.93333333329},null,null,null,{"$f":"IF(Ber.BILAN!E39=\"\",\"\",Ber.BILAN!E39)","v":""},{"$f":"IF(J26=F26,\"Richtig!\",IF(J26=\"\",\"Fehlt\",\"Falsch\"))","v":"Fehlt"},{"$f":"IF(K26=\"Richtig!\",1,IF(K26=\"Formel: OK\",0.5,IF(OR(K26=\"Falsch\",K26=\"Fehlt\"),0,\"\")))","v":0},"│",1]
[null,null,null,"Goldene Bilanzregel im weiteren Sinn (31.12.)",null,{"$f":"IF(Hilfe.BILAN!H38=\"\",\"\",Hilfe.BILAN!H38)","v":1.0246150984261797},null,{"$f":"IF(OR(J25=\"\",J26=\"\"),\"-\",J25/J26)","v":"-"},null,{"$f":"IF(Ber.BILAN!H38=\"\",\"\",Ber.BILAN!H38)","v":""},{"$f":"IF(J27=F27,\"Richtig!\",IF(AND(H27<>\"\",J27<>F27,J27=H27),\"Formel: OK\",IF(J27=\"\",\"Fehlt\",\"Falsch\")))","v":"Fehlt"},{"$f":"IF(K27=\"Richtig!\",1,IF(K27=\"Formel: OK\",0.5,IF(OR(K27=\"Falsch\",K27=\"Fehlt\"),0,\"\")))","v":0},"│",1]
[]
[null,null,"2.","Analyse der Rentabilität"]
[null,null,null,"Einkünfte aus Land- und Forstwirtschaft",null,{"$f":"IF(Hilfe.RENT!H6=\"\",\"\",Hilfe.RENT!H6)","v":25010.333333333336},null,"-",null,{"$f":"IF(Ber.RENT!H6=\"\",\"\",Ber.RENT!H6)","v":""},{"$f":"IF(J30=F30,\"Richtig!\",IF(J30=\"\",\"Fehlt\",\"Falsch\"))","v":"Fehlt"},{"$f":"IF(K30=\"Richtig!\",1,IF(K30=\"Formel: OK\",0.5,IF(OR(K30=\"Falsch\",K30=\"Fehlt\"),0,\"\")))","v":0},"│",1]
[]
[null,null,null,"Einkünfte LuF",null,{"$f":"IF(Hilfe.RENT!E14=\"\",\"\",Hilfe.RENT!E14)","v":25010.333333333336},null,"-",null,{"$f":"IF(Ber.RENT!E14=\"\",\"\",Ber.RENT!E14)","v":""},{"$f":"IF(J32=F32,\"Richtig!\",IF(J32=\"\",\"Fehlt\",\"Falsch\"))","v":"Fehlt"},{"$f":"IF(K32=\"Richtig!\",1,IF(K32=\"Formel: OK\",0.5,IF(OR(K32=\"Falsch\",K32=\"Fehlt\"),0,\"\")))","v":0},"│",1]
[null,null,null,"Ertrag",null,{"$f":"IF(Hilfe.RENT!E15=\"\",\"\",Hilfe.RENT!E15)","v":75190},null,"-",null,{"$f":"IF(Ber.RENT!E15=\"\",\"\",Ber.RENT!E15)","v":""},{"$f":"IF(J33=F33,\"Richtig!\",IF(J33=\"\",\"Fehlt\",\"Falsch\"))","v":"Fehlt"},{"$f":"IF(K33=\"Richtig!\",1,IF(K33=\"Formel: OK\",0.5,IF(OR(K33=\"Falsch\",K33=\"Fehlt\"),0,\"\")))","v":0},"│",1]
[null,null,null,"Gewinnrate",null,{"$f":"IF(Hilfe.RENT!H14=\"\",\"\",Hilfe.RENT!H14)","v":0.33262845236511951},null,{"$f":"IF(OR(J32=\"\",J33=\"\"),\"-\",J32/J33)","v":"-"},null,{"$f":"IF(Ber.RENT!H14=\"\",\"\",Ber.RENT!H14)","v":""},{"$f":"IF(J34=F34,\"Richtig!\",IF(AND(H34<>\"\",J34<>F34,J34=H34),\"Formel: OK\",IF(J34=\"\",\"Fehlt\",\"Falsch\")))","v":"Fehlt"},{"$f":"IF(K34=\"Richtig!\",1,IF(K34=\"Formel: OK\",0.5,IF(OR(K34=\"Falsch\",K34=\"Fehlt\"),0,\"\")))","v":0},"│",1]
[]
[null,null,null,"Gewinn",null,{"$f":"IF(Hilfe.RENT!C21=\"\",\"\",Hilfe.RENT!C21)","v":25010.333333333336},null,"-",null,{"$f":"IF(Ber.RENT!C21=\"\",\"\",Ber.RENT!C21)","v":""},{"$f":"IF(J36=F36,\"Richtig!\",IF(J36=\"\",\"Fehlt\",\"Falsch\"))","v":"Fehlt"},{"$f":"IF(K36=\"Richtig!\",1,IF(K36=\"Formel: OK\",0.5,IF(OR(K36=\"Falsch\",K36=\"Fehlt\"),0,\"\")))","v":0},"│",1]
[null,null,null,"Arbeitsverdienst der nicht entlohnten Arbeitskräfte",null,{"$f":"IF(Hilfe.RENT!C23=\"\",\"\",Hilfe.RENT!C23)","v":18429.46066666667},null,{"$f":"IF(OR(Ber.RENT!C22,J36=\"\"),\"-\",SUM(Ber.RENT!C22,J36))","v":"-"},null,{"$f":"IF(Ber.RENT!C23=\"\",\"\",Ber.RENT!C23)","v":""},{"$f":"IF(J37=F37,\"Richtig!\",IF(AND(H37<>\"\",J37<>F37,J37=H37),\"Formel: OK\",IF(J37=\"\",\"Fehlt\",\"Falsch\")))","v":"Fehlt"},{"$f":"IF(K37=\"Richtig!\",1,IF(K37=\"Formel: OK\",0.5,IF(OR(K37=\"Falsch\",K37=\"Fehlt\"),0,\"\")))","v":0},"│",1]
[]
[null,null,null,"Gewinn",null,{"$f":"IF(Hilfe.RENT!C28=\"\",\"\",Hilfe.RENT!C28)","v":25010.333333333336},null,"-",null,{"$f":"IF(Ber.RENT!C28=\"\",\"\",Ber.RENT!C28)","v":""},{"$f":"IF(J39=F39,\"Richtig!\",IF(J39=\"\",\"Fehlt\",\"Falsch\"))","v":"Fehlt"},{"$f":"IF(K39=\"Richtig!\",1,IF(K39=\"Formel: OK\",0.5,IF(OR(K39=\"Falsch\",K39=\"Fehlt\"),0,\"\")))","v":0},"│",1]
[null,null,null,"Vermögensrente",null,{"$f":"IF(Hilfe.RENT!C30=\"\",\"\",Hilfe.RENT!C30)","v":3713.3333333333358},null,{"$f":"IF(OR(Ber.RENT!C29,J39=\"\"),\"-\",SUM(Ber.RENT!C29,J39))","v":"-"},null,{"$f":"IF(Ber.RENT!C30=\"\",\"\",Ber.RENT!C30)","v":""},{"$f":"IF(J40=F40,\"Richtig!\",IF(AND(H40<>\"\",J40<>F40,J40=H40),\"Formel: OK\",IF(J40=\"\",\"Fehlt\",\"Falsch\")))","v":"Fehlt"},{"$f":"IF(K40=\"Richtig!\",1,IF(K40=\"Formel: OK\",0.5,IF(OR(K40=\"Falsch\",K40=\"Fehlt\"),0,\"\")))","v":0},"│",1]
[]
[null,null,null,"Gewinn",null,{"$f":"IF(Hilfe.RENT!C34=\"\",\"\",Hilfe.RENT!C34)","v":25010.333333333336},null,"-",null,{"$f":"IF(Ber.RENT!C34=\"\",\"\",Ber.RENT!C34)","v":""},{"$f":"IF(J42=F42,\"Richtig!\",IF(J42=\"\",\"Fehlt\",\"Falsch\"))","v":"Fehlt"},{"$f":"IF(K42=\"Richtig!\",1,IF(K42=\"Formel: OK\",0.5,IF(OR(K42=\"Falsch\",K42=\"Fehlt\"),0,\"\")))","v":0},"│",1]
[null,null,null,"Unternehmergewinn",null,{"$f":"IF(Hilfe.RENT!C37=\"\",\"\",Hilfe.RENT!C37)","v":-2867.5393333333304},null,{"$f":"IF(OR(Ber.RENT!C35,Ber.RENT!C36,J42=\"\"),\"-\",SUM(Ber.RENT!C35,Ber.RENT!C36,J42))","v":"-"},null,{"$f":"IF(Ber.RENT!C37=\"\",\"\",Ber.RENT!C37)","v":""},{"$f":"IF(J43=F43,\"Richtig!\",IF(AND(H43<>\"\",J43<>F43,J43=H43),\"Formel: OK\",IF(J43=\"\",\"Fehlt\",\"Falsch\")))","v":"Fehlt"},{"$f":"IF(K43=\"Richtig!\",1,IF(K43=\"Formel: OK\",0.5,IF(OR(K43=\"Falsch\",K43=\"Fehlt\"),0,\"\")))","v":0},"│",1]
[]
[null,null,null,"Einkünfte LuF - LA",null,{"$f":"IF(Hilfe.RENT!E43=\"\",\"\",Hilfe.RENT!E43)","v":3713.3333333333358},null,"-",null,{"$f":"IF(Ber.RENT!E43=\"\",\"\",Ber.RENT!E43)","v":""},{"$f":"IF(J45=F45,\"Richtig!\",IF(J45=\"\",\"Fehlt\",\"Falsch\"))","v":"Fehlt"},{"$f":"IF(K45=\"Richtig!\",1,IF(K45=\"Formel: OK\",0.5,IF(OR(K45=\"Falsch\",K45=\"Fehlt\"),0,\"\")))","v":0},"│",1]
[null,null,null,"Eigenkapital",null,{"$f":"IF(Hilfe.RENT!E44=\"\",\"\",Hilfe.RENT!E44)","v":188024.93333333329},null,"-",null,{"$f":"IF(Ber.RENT!E44=\"\",\"\",Ber.RENT!E44)","v":""},{"$f":"IF(J46=F46,\"Richtig!\",IF(J46=\"\",\"Fehlt\",\"Falsch\"))","v":"Fehlt"},{"$f":"IF(K46=\"Richtig!\",1,IF(K46=\"Formel: OK\",0.5,IF(OR(K46=\"Falsch\",K46=\"Fehlt\"),0,\"\")))","v":0},"│",1]
[null,null,null,"Eigenkapitalrentabiliät",null,{"$f":"IF(Hilfe.RENT!H43=\"\",\"\",Hilfe.RENT!H43)","v":1.9749153835626074E-2},null,{"$f":"IF(OR(J45=\"\",J46=\"\"),\"-\",J45/J46)","v":"-"},null,{"$f":"IF(Ber.RENT!H43=\"\",\"\",Ber.RENT!H43)","v":""},{"$f":"IF(J47=F47,\"Richtig!\",IF(AND(H47<>\"\",J47<>F47,J47=H47),\"Formel: OK\",IF(J47=\"\",\"Fehlt\",\"Falsch\")))","v":"Fehlt"},{"$f":"IF(K47=\"Richtig!\",1,IF(K47=\"Formel: OK\",0.5,IF(OR(K47=\"Falsch\",K47=\"Fehlt\"),0,\"\")))","v":0},"│",1]
[]
[null,null,null,"Einkünfte LuF + SZ - LA",null,{"$f":"IF(Hilfe.RENT!E51=\"\",\"\",Hilfe.RENT!E51)","v":4813.3333333333358},null,"-",null,{"$f":"IF(Ber.RENT!E51=\"\",\"\",Ber.RENT!E51)","v":""},{"$f":"IF(J49=F49,\"Richtig!\",IF(J49=\"\",\"Fehlt\",\"Falsch\"))","v":"Fehlt"},{"$f":"IF(K49=\"Richtig!\",1,IF(K49=\"Formel: OK\",0.5,IF(OR(K49=\"Falsch\",K49=\"Fehlt\"),0,\"\")))","v":0},"│",1]
[null,null,null,"Gesamtkapital",null,{"$f":"IF(Hilfe.RENT!E52=\"\",\"\",Hilfe.RENT!E52)","v":269524.93333333329},null,"-",null,{"$f":"IF(Ber.RENT!E52=\"\",\"\",Ber.RENT!E52)","v":""},{"$f":"IF(J50=F50,\"Richtig!\",IF(J50=\"\",\"Fehlt\",\"Falsch\"))","v":"Fehlt"},{"$f":"IF(K50=\"Richtig!\",1,IF(K50=\"Formel: OK\",0.5,IF(OR(K50=\"Falsch\",K50=\"Fehlt\"),0,\"\")))","v":0},"│",1]
[null,null,null,"Gesamtkapitalrentabilität",null,{"$f":"IF(Hilfe.RENT!H51=\"\",\"\",Hilfe.RENT!H51)","v":1.785858278046757E-2},null,{"$f":"IF(OR(J49=\"\",J50=\"\"),\"-\",J49/J50)","v":"-"},null,{"$f":"IF(Ber.RENT!H51=\"\",\"\",Ber.RENT!H51)","v":""},{"$f":"IF(J51=F51,\"Richtig!\",IF(AND(H51<>\"\",J51<>F51,J51=H51),\"Formel: OK\",IF(J51=\"\",\"Fehlt\",\"Falsch\")))","v":"Fehlt"},{"$f":"IF(K51=\"Richtig!\",1,IF(K51=\"Formel: OK\",0.5,IF(OR(K51=\"Falsch\",K51=\"Fehlt\"),0,\"\")))","v":0},"│",1]
[]
[null,null,"3.","Analyse der Finazierungskraft"]
[null,null,null,"Cash Flow I",null,{"$f":"IF(Hilfe.FIN!C14=\"\",\"\",Hilfe.FIN!C14)","v":42945},null,"-",null,{"$f":"IF(Ber.FIN!C14=\"\",\"\",Ber.FIN!C14)","v":""},{"$f":"IF(J54=F54,\"Richtig!\",IF(J54=\"\",\"Fehlt\",\"Falsch\"))","v":"Fehlt"},{"$f":"IF(K54=\"Richtig!\",1,IF(K54=\"Formel: OK\",0.5,IF(OR(K54=\"Falsch\",K54=\"Fehlt\"),0,\"\")))","v":0},"│",1]
[null,null,null,"Cash Flow II",null,{"$f":"IF(Hilfe.FIN!C17=\"\",\"\",Hilfe.FIN!C17)","v":9445},null,"-",null,{"$f":"IF(Ber.FIN!C17=\"\",\"\",Ber.FIN!C17)","v":""},{"$f":"IF(J55=F55,\"Richtig!\",IF(J55=\"\",\"Fehlt\",\"Falsch\"))","v":"Fehlt"},{"$f":"IF(K55=\"Richtig!\",1,IF(K55=\"Formel: OK\",0.5,IF(OR(K55=\"Falsch\",K55=\"Fehlt\"),0,\"\")))","v":0},"│",1]
[null,null,null,"Cash Flow III",null,{"$f":"IF(Hilfe.FIN!C20=\"\",\"\",Hilfe.FIN!C20)","v":-12425},null,"-",null,{"$f":"IF(Ber.FIN!C20=\"\",\"\",Ber.FIN!C20)","v":""},{"$f":"IF(J56=F56,\"Richtig!\",IF(J56=\"\",\"Fehlt\",\"Falsch\"))","v":"Fehlt"},{"$f":"IF(K56=\"Richtig!\",1,IF(K56=\"Formel: OK\",0.5,IF(OR(K56=\"Falsch\",K56=\"Fehlt\"),0,\"\")))","v":0},"│",1]
[]
[null,null,null,"Kapitalflussrechnung"]
[null,null,null,"Summe Einnahmen",null,{"$f":"IF(Hilfe.FIN!B34=\"\",\"\",Hilfe.FIN!B34)","v":76575},null,"-",null,{"$f":"IF(Ber.FIN!B34=\"\",\"\",Ber.FIN!B34)","v":""},{"$f":"IF(J59=F59,\"Richtig!\",IF(J59=\"\",\"Fehlt\",\"Falsch\"))","v":"Fehlt"},{"$f":"IF(K59=\"Richtig!\",1,IF(K59=\"Formel: OK\",0.5,IF(OR(K59=\"Falsch\",K59=\"Fehlt\"),0,\"\")))","v":0},"│",1]
[null,null,null,"Summe Ausgaben",null,{"$f":"IF(Hilfe.FIN!C39=\"\",\"\",Hilfe.FIN!C39)","v":32080},null,"-",null,{"$f":"IF(Ber.FIN!C39=\"\",\"\",Ber.FIN!C39)","v":""},{"$f":"IF(J60=F60,\"Richtig!\",IF(J60=\"\",\"Fehlt\",\"Falsch\"))","v":"Fehlt"},0,"│",1]
[null,null,null,"Umsatzbereich",null,{"$f":"IF(Hilfe.FIN!D40=\"\",\"\",Hilfe.FIN!D40)","v":44495},null,{"$f":"IF(OR(J59=\"\",J60=\"\"),\"-\",SUM(J59:J60))","v":"-"},null,{"$f":"IF(Ber.FIN!D40=\"\",\"\",Ber.FIN!D40)","v":""},{"$f":"IF(J61=F61,\"Richtig!\",IF(AND(H61<>\"\",J61<>F61,J61=H61),\"Formel: OK\",IF(J61=\"\",\"Fehlt\",\"Falsch\")))","v":"Fehlt"},0,"│",1]
[null,null,null,"Anlagenbereich",null,{"$f":"IF(Hilfe.FIN!D43=\"\",\"\",Hilfe.FIN!D43)","v":-25000},null,"-",null,{"$f":"IF(Ber.FIN!D43=\"\",\"\",Ber.FIN!D43)","v":""},{"$f":"IF(J62=F62,\"Richtig!\",IF(AND(H62<>\"\",J62<>F62,J62=H62),\"Formel: OK\",IF(J62=\"\",\"Fehlt\",\"Falsch\")))","v":"Fehlt"},0,"│",1]
[null,null,null,"Fremdkapitalbereich",null,{"$f":"IF(Hilfe.FIN!D46=\"\",\"\",Hilfe.FIN!D46)","v":-8500},null,"-",null,{"$f":"IF(Ber.FIN!D46=\"\",\"\",Ber.FIN!D46)","v":""},{"$f":"IF(J63=F63,\"Richtig!\",IF(AND(H63<>\"\",J63<>F63,J63=H63),\"Formel: OK\",IF(J63=\"\",\"Fehlt\",\"Falsch\")))","v":"Fehlt"},0,"│",1]
[null,null,null,"Privatbereich",null,{"$f":"IF(Hilfe.FIN!D49=\"\",\"\",Hilfe.FIN!D49)","v":-21870},null,"-",null,{"$f":"IF(Ber.FIN!D49=\"\",\"\",Ber.FIN!D49)","v":""},{"$f":"IF(J64=F64,\"Richtig!\",IF(AND(H64<>\"\",J64<>F64,J64=H64),\"Formel: OK\",IF(J64=\"\",\"Fehlt\",\"Falsch\")))","v":"Fehlt"},0,"│",1]
[null,null,null,"Geldbereich",null,{"$f":"IF(Hilfe.FIN!D53=\"\",\"\",Hilfe.FIN!D53)","v":10875},null,"-",null,{"$f":"IF(Ber.FIN!D53=\"\",\"\",Ber.FIN!D53)","v":""},{"$f":"IF(J65=F65,\"Richtig!\",IF(AND(H65<>\"\",J65<>F65,J65=H65),\"Formel: OK\",IF(J65=\"\",\"Fehlt\",\"Falsch\")))","v":"Fehlt"},0,"│",1]
[]
[null,null,"4.","Analyse der Stabilität"]
[null,null,null,"Veralterungsgrad von abnutzbarem Anlagevermögen"]
[null,null,null,"Buchwert (31.12.)",null,{"$f":"IF(Hilfe.STAB!E13=\"\",\"\",Hilfe.STAB!E13)","v":123100},null,"-",null,{"$f":"IF(Ber.STAB!E13=\"\",\"\",Ber.STAB!E13)","v":""},{"$f":"IF(J69=F69,\"Richtig!\",IF(J69=\"\",\"Fehlt\",\"Falsch\"))","v":"Fehlt"},{"$f":"IF(K69=\"Richtig!\",1,IF(K69=\"Formel: OK\",0.5,IF(OR(K69=\"Falsch\",K69=\"Fehlt\"),0,\"\")))","v":0},"│",1]
[null,null,null,"Summe Anschaffungswert",null,{"$f":"IF(Hilfe.STAB!E14=\"\",\"\",Hilfe.STAB!E14)","v":251000},null,"-",null,{"$f":"IF(Ber.STAB!E14=\"\",\"\",Ber.STAB!E14)","v":""},{"$f":"IF(J70=F70,\"Richtig!\",IF(J70=\"\",\"Fehlt\",\"Falsch\"))","v":"Fehlt"},{"$f":"IF(K70=\"Richtig!\",1,IF(K70=\"Formel: OK\",0.5,IF(OR(K70=\"Falsch\",K70=\"Fehlt\"),0,\"\")))","v":0},"│",1]
[null,null,null,"Gebäude und bauliche Anlagen",null,{"$f":"IF(Hilfe.STAB!H13=\"\",\"\",Hilfe.STAB!H13)","v":0.49043824701195221},null,{"$f":"IF(OR(J69=\"\",J70=\"\"),\"-\",J69/J70)","v":"-"},null,{"$f":"IF(Ber.STAB!H13=\"\",\"\",Ber.STAB!H13)","v":""},{"$f":"IF(J71=F71,\"Richtig!\",IF(AND(H71<>\"\",J71<>F71,J71=H71),\"Formel: OK\",IF(J71=\"\",\"Fehlt\",\"Falsch\")))","v":"Fehlt"},{"$f":"IF(K71=\"Richtig!\",1,IF(K71=\"Formel: OK\",0.5,IF(OR(K71=\"Falsch\",K71=\"Fehlt\"),0,\"\")))","v":0},"│",1]
[]
[null,null,null,"Buchwert (31.12.)",null,{"$f":"IF(Hilfe.STAB!E18=\"\",\"\",Hilfe.STAB!E18)","v":106700.33333333333},null,"-",null,{"$f":"IF(Ber.STAB!E18=\"\",\"\",Ber.STAB!E18)","v":""},{"$f":"IF(J73=F73,\"Richtig!\",IF(J73=\"\",\"Fehlt\",\"Falsch\"))","v":"Fehlt"},{"$f":"IF(K73=\"Richtig!\",1,IF(K73=\"Formel: OK\",0.5,IF(OR(K73=\"Falsch\",K73=\"Fehlt\"),0,\"\")))","v":0},"│",1]
[null,null,null,"Summe Anschaffungswert",null,{"$f":"IF(Hilfe.STAB!E19=\"\",\"\",Hilfe.STAB!E19)","v":202106},null,"-",null,{"$f":"IF(Ber.STAB!E19=\"\",\"\",Ber.STAB!E19)","v":""},{"$f":"IF(J74=F74,\"Richtig!\",IF(J74=\"\",\"Fehlt\",\"Falsch\"))","v":"Fehlt"},{"$f":"IF(K74=\"Richtig!\",1,IF(K74=\"Formel: OK\",0.5,IF(OR(K74=\"Falsch\",K74=\"Fehlt\"),0,\"\")))","v":0},"│",1]
[null,null,null,"Maschinen und Geräte",null,{"$f":"IF(Hilfe.STAB!H18=\"\",\"\",Hilfe.STAB!H18)","v":0.52794243284876907},null,{"$f":"IF(OR(J73=\"\",J74=\"\"),\"-\",J73/J74)","v":"-"},null,{"$f":"IF(Ber.STAB!H18=\"\",\"\",Ber.STAB!H18)","v":""},{"$f":"IF(J75=F75,\"Richtig!\",IF(AND(H75<>\"\",J75<>F75,J75=H75),\"Formel: OK\",IF(J75=\"\",\"Fehlt\",\"Falsch\")))","v":"Fehlt"},{"$f":"IF(K75=\"Richtig!\",1,IF(K75=\"Formel: OK\",0.5,IF(OR(K75=\"Falsch\",K75=\"Fehlt\"),0,\"\")))","v":0},"│",1]
[]
[null,null,null,"Eigenkapitalveränderung",null,{"$f":"IF(Hilfe.STAB!E29=\"\",\"\",Hilfe.STAB!E29)","v":2975.3333333333358},null,"-",null,{"$f":"IF(Ber.STAB!E29=\"\",\"\",Ber.STAB!E29)","v":""},{"$f":"IF(J77=F77,\"Richtig!\",IF(J77=\"\",\"Fehlt\",\"Falsch\"))","v":"Fehlt"},{"$f":"IF(K77=\"Richtig!\",1,IF(K77=\"Formel: OK\",0.5,IF(OR(K77=\"Falsch\",K77=\"Fehlt\"),0,\"\")))","v":0},"│",1]
[]
[null,null,null,"Kapitaldienstgrenze"]
[null,null,null,"langfristige Kapitaldienstgrenze",null,{"$f":"IF(Hilfe.STAB!E41=\"\",\"\",Hilfe.STAB!E41)","v":4075.3333333333358},null,"-",null,{"$f":"IF(Ber.STAB!E41=\"\",\"\",Ber.STAB!E41)","v":""},{"$f":"IF(J80=F80,\"Richtig!\",IF(J80=\"\",\"Fehlt\",\"Falsch\"))","v":"Fehlt"},{"$f":"IF(K80=\"Richtig!\",1,IF(K80=\"Formel: OK\",0.5,IF(OR(K80=\"Falsch\",K80=\"Fehlt\"),0,\"\")))","v":0},"│",1]
[null,null,null,"mittelfristige Kapitaldienstgrenze",null,{"$f":"IF(Hilfe.STAB!E43=\"\",\"\",Hilfe.STAB!E43)","v":15375.333333333336},null,"-",null,{"$f":"IF(Ber.STAB!E43=\"\",\"\",Ber.STAB!E43)","v":""},{"$f":"IF(J81=F81,\"Richtig!\",IF(J81=\"\",\"Fehlt\",\"Falsch\"))","v":"Fehlt"},{"$f":"IF(K81=\"Richtig!\",1,IF(K81=\"Formel: OK\",0.5,IF(OR(K81=\"Falsch\",K81=\"Fehlt\"),0,\"\")))","v":0},"│",1]
[null,null,null,"kurzfristige Kapitaldienstgrenze",null,{"$f":"IF(Hilfe.STAB!E45=\"\",\"\",Hilfe.STAB!E45)","v":22175.000000000004},null,"-",null,{"$f":"IF(Ber.STAB!E45=\"\",\"\",Ber.STAB!E45)","v":""},{"$f":"IF(J82=F82,\"Richtig!\",IF(J82=\"\",\"Fehlt\",\"Falsch\"))","v":"Fehlt"},{"$f":"IF(K82=\"Richtig!\",1,IF(K82=\"Formel: OK\",0.5,IF(OR(K82=\"Falsch\",K82=\"Fehlt\"),0,\"\")))","v":0},"│",1]
[]
[null,null,"Gesamtpunktezahl",null,null,null,null,null,null,null,null,{"$f":"SUM(L9:L82)","v":0},"│",{"$f":"SUM(N9:N82)","v":51}]
[]
[]
[null,null,"Note",null,{"$f":"L84/N84","v":0}]
[null,null,null,{"$f":"E88-E98","v":46},{"$f":"N84","v":51},{"$f":"IF(AND(L84>=D88-0.5,L84<=E88),\"u\",\"j\")","v":"j"},{"$f":"IF(OR(L84=D88-0.5,L84=D88),\"-\",\"\")","v":""}]
[null,null,null,{"$f":"E89-E98","v":40},{"$f":"D88-1","v":45},{"$f":"IF(AND(L84>=D89-0.5,L84<=E89),\"v\",\"k\")","v":"k"},{"$f":"IF(OR(L84=D89-0.5,L84=D89),\"-\",IF(OR(L84=E89-0.5,L84=E89),\"+\",\"\"))","v":""}]
[null,null,null,{"$f":"E90-E98-1","v":33},{"$f":"D89-1","v":39},{"$f":"IF(AND(L84>=D90-0.5,L84<=E90),\"w\",\"l\")","v":"l"},{"$f":"IF(OR(L84=D90-0.5,L84=D90),\"-\",IF(OR(L84=E90-0.5,L84=E90),\"+\",\"\"))","v":""}]
[null,null,null,{"$f":"E91-E98-1","v":26},{"$f":"D90-1","v":32},{"$f":"IF(AND(L84>=D91-0.5,L84<=E91),\"x\",\"m\")","v":"m"},{"$f":"IF(OR(L84=D91-0.5,L84=D91),\"-\",IF(OR(L84=E91-0.5,L84=E91),\"+\",\"\"))","v":""}]
[null,null,null,0,{"$f":"D91-1","v":25},{"$f":"IF(AND(L84>=D92-0.5,L84<=E92),\"y\",\"n\")","v":"y"},{"$f":"IF(OR(L84=E92-1,L84=E92-0.5,L84=E92),\"+\",\"\")","v":""}]
[]
[]
[null,null,null,"Korrekturblatt - Maschinenkostenrechnung"]
[null,null,null,null,null,{"$f":"COUNT(F9:F82)","v":51},null,null,null,{"$f":"COUNT(J9:J82)","v":0}]
[null,null,null,"Abstufung:",0.1]
[null,null,null,null,{"$f":"ROUND(N84*E97,0)","v":5}]

{"sheet":"Hilfe.BILAN","index":8,"n_rows":43,"n_cols":14,"rows_kept":43,"cut":false,"hidden":false,"merged":[[4,13,37,13],[42,2,42,9],[34,2,34,9],[37,3,38,3],[37,5,38,5],[37,6,38,6],[37,7,38,7],[24,2,24,9],[25,2,25,9],[29,3,30,3],[29,5,30,5],[29,6,30,6],[29,7,30,7],[17,3,18,3],[17,5,18,5],[17,6,18,6],[17,7,18,7],[23,2,23,9],[10,3,11,3],[10,5,11,5],[10,6,11,6],[10,7,11,7],[14,2,14,9],[2,2,2,9],[5,3,6,3],[5,5,6,5],[5,6,6,6],[5,7,6,7]]}
[null,null,"Bilanzanalyse"]
[]
[null,null,"Die Bilanzanalyse liefert wertvolle Auskünfte hinsichtlich der finanzwirtschaftlichen Situation des Betriebs bzw. Unternehmens. Bei Vergleichen zwischen Betrieben muss darauf geachtet werden, dass die Posten der Bilanz einheitlich bewertet wurden (wichtig vor allem beim Boden oder dem stehenden Holz)."]
[]
[null,null,"Eigenkapitalanteil (31.12.)",null,null,null,null,null,null,null,null,null,null,"B   U   C   H   F   Ü   H   R   U   N   G"]
[null,null,"Eigenkapital","=",{"$f":"+BUCHFÜHRUNG!F15","v":188024.93333333329},"x 100","=",{"$f":"+E6/E7","v":0.69761610181272027}]
[null,null,"Gesamtkapital",null,{"$f":"+BUCHFÜHRUNG!F22","v":269524.93333333329}]
[]
[]
[null,null,"Verschuldungsgrad  (31.12.)"]
[null,null,"Fremdkapital","=",{"$f":"+BUCHFÜHRUNG!F16","v":81500},"x 100","=",{"$f":"+E11/E12","v":0.30238389818727968}]
[null,null,"Gesamtkapital",null,{"$f":"+BUCHFÜHRUNG!F22","v":269524.93333333329}]
[]
[]
[null,null,"Je höher der Eigenkapitalanteil und je niedriger der Verschuldungsgrad, desto geringer ist die Abhängigkeit eines landwirtschaftlichen Betriebs von Kreditgebern und desto vorsichtiger wurde finanziert. "]
[]
[null,null,"Anlagenintensität  (31.12.)"]
[null,null,"Anlagevermögen1","=",{"$f":"+BUCHFÜHRUNG!D15+BUCHFÜHRUNG!D16","v":229800.33333333331},"x 100","=",{"$f":"+E18/E19","v":0.85261252267570053}]
[null,null,"Gesamtvermögen",null,{"$f":"+BUCHFÜHRUNG!D22","v":269524.93333333329}]
[null,null,"1 Wirtschaftsgebäude  +  Maschinen und Geräte"]
[]
[]
[null,null,"Für einen landwirtschaftlichen Betrieb gilt:"]
[null,null,"Je höher die Anlagenintensität, desto mehr ist er in seinem Aufbau gebunden, umso stärker ist die Belastung mit Fixkosten. "]
[null,null,"Je höher die Anlagenintensität, desto langsamer setzt er das Vermögen um, die Verzinsung des Vermögens ist meist gering."]
[null,null,"Die relative Erhöhung der Anlagenintensität kann sich jedoch auch aus Einsparungen beim Umlaufvermögen ergeben.   "]
[]
[]
[null,null,"Goldene Bilanzregel im engeren Sinn (31.12.)"]
[null,null,"EK + langfrist. FK2","=",{"$f":"+BUCHFÜHRUNG!F15+BUCHFÜHRUNG!F16","v":269524.93333333329},"x 100","=",{"$f":"+E30/E31","v":1.1728657196609811}]
[null,null,"Anlagenvermögen (AV)",null,{"$f":"+BUCHFÜHRUNG!D15+BUCHFÜHRUNG!D16","v":229800.33333333331}]
[null,null,"2 EK = Eigenkapital, FK = Fremdkapital"]
[]
[]
[null,null,"Die „goldene Bilanzregel“ im engeren Sinne besagt, dass das Anlagevermögen langfristig zu finanzieren ist."]
[]
[null,null,"Goldene Bilanzregel im weiteren Sinn (31.12.)"]
[null,null,"EK + langfrist. FK","=",{"$f":"+E30","v":269524.93333333329},"x 100","=",{"$f":"+E38/E39","v":1.0246150984261797}]
[null,null,"AV + gebundenes UV3",null,{"$f":"+E31+BUCHFÜHRUNG!D17+BUCHFÜHRUNG!D18","v":263049.93333333329}]
[null,null,"3 gebundenes Umlaufvermögen (UV): Viehvermögen und Vorräte"]
[]
[]
[null,null,"Als „goldene Bilanzregel“ im weiteren Sinne wird der Grundsatz bezeichnet, dass das Anlage- und das gebundene Umlaufvermögen zusammen langfristig finanziert werden sollen:"]

{"sheet":"Hilfe.RENT","index":9,"n_rows":62,"n_cols":14,"rows_kept":62,"cut":false,"hidden":false,"merged":[[19,2,19,8],[20,3,20,6],[21,3,21,6],[22,3,22,6],[27,3,27,4],[28,3,28,4],[58,5,58,6],[59,5,59,6],[60,5,60,6],[61,5,61,6],[29,3,29,6],[33,3,33,6],[34,3,34,6],[35,3,35,6],[39,2,39,9],[2,2,2,9],[5,4,5,5],[8,2,8,9],[9,2,9,9],[10,2,10,9],[3,13,61,13],[13,3,14,3],[13,5,14,5],[13,6,14,6],[13,7,14,7],[17,2,17,9],[42,3,43,3],[42,5,43,5],[42,6,43,6],[42,7,43,7],[47,2,47,9],[50,3,51,3],[50,5,51,5],[50,6,51,6],[50,7,51,7],[55,2,55,9]]}
[null,null,"Analyse der Rentabilität"]
[]
[null,null,"Die Analyse der Rentabilität ermittelt den Ertrag der eingesetzten Produktionsfaktoren „Arbeit“ und „Kapital“ im Vergleich zum benötigten Aufwand."]
[null,null,null,null,null,null,null,null,null,null,null,null,null,"B   U   C   H   F   Ü   H   R   U   N   G"]
[null,null,"Einkünfte aus Land- und Forstwirtschaft"]
[null,null,{"$f":"+BUCHFÜHRUNG!F32","v":75190},"-",{"$f":"+SUM(BUCHFÜHRUNG!D25:D30)","v":50179.666666666664},null,"=",{"$f":"+C6-E6","v":25010.333333333336}]
[]
[]
[null,null,"Die Einkünfte stellen"]
[null,null,"die Abgeltung für die geleistete Arbeit der nicht entlohnten Arbeitskräfte für die unternehmerische Tätigkeit und "]
[null,null,"die Verzinsung für den Einsatz des Eigenkapitals dar.  "]
[]
[null,null,"Gewinnrate"]
[null,null,"Einkünfte LuF","=",{"$f":"+H6","v":25010.333333333336},"x 100","=",{"$f":"+E14/E15","v":0.33262845236511951}]
[null,null,"Ertrag",null,{"$f":"+Hilfe.RENT!C6","v":75190}]
[]
[]
[null,null,"Je höher die Gewinnrate eines Unternehmens, desto effizienter arbeitet es und umso leichter können Krisenzeiten bei sinkenden Erzeugerpreisen überstanden werden. "]
[]
[null,null,{"$f":"BUCHFÜHRUNG!D49/100","v":3.5000000000000003E-2}]
[null,null,{"$f":"+H6","v":25010.333333333336}," Gewinn"]
[null,null,{"$f":"-BUCHFÜHRUNG!F15*C20","v":-6580.8726666666662},"Zinsansatz Eigenkapital*"]
[null,null,{"$f":"+C21+C22","v":18429.46066666667},"Arbeitsverdienst"]
[null,null,{"$f":"\"* \"&TEXT(BUCHFÜHRUNG!F15,\"# ##0,-\")&\" Euro mal Zinssatz von \"&BUCHFÜHRUNG!D49&\"%\"","v":"* 188 025,- Euro mal Zinssatz von 3,5%"}]
[]
[]
[null,null,"Vermögensrente"]
[null,null,{"$f":"+H6","v":25010.333333333336}," Gewinn"]
[null,null,{"$f":"-BUCHFÜHRUNG!D48","v":-21297},"Lohnansatz"]
[null,null,{"$f":"+C28+C29","v":3713.3333333333358},"Vermögensrente"]
[]
[]
[null,null,"Unternehmergewinn"]
[null,null,{"$f":"+H6","v":25010.333333333336}," Gewinn"]
[null,null,{"$f":"+C22","v":-6580.8726666666662},"Zinsansatz Eigenkapital"]
[null,null,{"$f":"+C29","v":-21297},"Lohnansatz"]
[null,null,{"$f":"+C34+C35+C36","v":-2867.5393333333304},"Unternehmergewinn (-verlust)"]
[]
[]
[null,null,"Der Unternehmergewinn bzw. Unternehmerverlust informiert über die Entlohnung der unternehmerischen Leistung, wenn vom Gewinn sowohl der Lohn- als auch der Zinsansatz abgezogen sind."]
[]
[null,null,"Eigenkapitalrentabiliät"]
[null,null,"Einkünfte LuF - LA","=",{"$f":"+C34+C36","v":3713.3333333333358},"x 100","=",{"$f":"+E43/E44","v":1.9749153835626074E-2}]
[null,null,"Eigenkapital",null,{"$f":"+BUCHFÜHRUNG!F15","v":188024.93333333329}]
[null,null,"LA = Lohnansatz"]
[]
[]
[null,null,"Vom Gewinn wird der Lohnansatz für die nicht entlohnten Arbeitskräfte abzogen, die resultierende Differenz wird durch das betrieblich gebundene Eigenkapital dividiert. "]
[]
[null,null,"Gesamtkapitalrentabilität",null,null,null,null,null,null,"ROI"]
[null,null,"Einkünfte LuF + SZ - LA","=",{"$f":"+H6+C36+BUCHFÜHRUNG!D27","v":4813.3333333333358},"x 100","=",{"$f":"+E51/E52","v":1.785858278046757E-2}]
[null,null,"Gesamtkapital",null,{"$f":"+BUCHFÜHRUNG!D22","v":269524.93333333329}]
[null,null,"LA = Lohnansatz, SZ = Schuldzinsen"]
[]
[]
[null,null,"Schulden sind Bestandteil des Gesamtkapitals, deshalb werden die Schuldzinsen wieder hinzugerechnet (diese wurden im Aufwand zur Ermittlung der Einkünfte aus LuF)."]
[]
[]
[null,null,null,null,null,{"$f":"+H6","v":25010.333333333336},null,"Einkünfte aus LuF (Gewinn)"]
[null,null,null,null,null,{"$f":"BUCHFÜHRUNG!D27","v":1100},null,"Schuldzinsen"]
[null,null,null,null,null,{"$f":"+C29","v":-21297},null,"Lohnansatz"]
[null,null,null,null,null,{"$f":"+F59+F60+F61","v":4813.3333333333358},null,{"$f":"C51","v":"Einkünfte LuF + SZ - LA"}]

{"sheet":"Hilfe.FIN","index":10,"n_rows":61,"n_cols":16,"rows_kept":61,"cut":false,"hidden":false,"merged":[[4,15,59,15],[4,0,4,10],[21,0,21,10],[33,2,33,3],[56,0,56,10],[53,0,53,3]]}
[]
[]
["Analyse der Finanzierungskraft"]
[]
["Die Analyse der Finanzierungskraft meint im Wesentlichen die Gegenüberstellung von Einnahmen und Ausgaben. Die Änderungen des Geldbereichs sollen die Finanzierungskraft aus Eigenmitteln veranschaulichen. Als Kennzahlen bzw. Methoden haben sich in diesem Zusammenhang der Cash-Flow sowie die Kapitalflussrechnung etabliert.",null,null,null,null,null,null,null,null,null,null,null,null,"Formeln anwenden",null,"B   U   C   H   F   Ü   H   R   U   N   G"]
[null,null,null,null,null,null,null,null,null,null,null,null,null,"Die Werte stammen aus der Buchführung!"]
["Cash Flow"]
[]
["Bezeichnung","Euro","Euro gesamt"]
["Einkünfte LuF",{"$f":"+BUCHFÜHRUNG!D31","v":25010.333333333336},null,"Einkünfte LuF laut GuV"]
["- Naturallieferung Milch",{"$f":"+BUCHFÜHRUNG!F138","v":165},null,"Ist ein Ertrag, aber keine Einnahme"]
["+ Minderung Viehvermögen",{"$f":"+BUCHFÜHRUNG!D148","v":0},null,"Ist ein Aufwand, aber sind keine Ausgaben"]
["+ Abschreibungen",{"$f":"+BUCHFÜHRUNG!D130+BUCHFÜHRUNG!D131","v":18099.666666666668},null,"Ist ein Aufwand, aber sind keine Ausgaben"]
["= Cash Flow I",null,{"$f":"+B10-B11+B12+B13","v":42945}]
["- Investitionen",{"$f":"+BUCHFÜHRUNG!D60","v":25000},null,"Kauf eines Ladewagens"]
["- Kreditrückzahlungen",{"$f":"+BUCHFÜHRUNG!D98","v":8500},null,"Tilgung"]
["= Cash Flow II",null,{"$f":"+C14-B15-B16","v":9445}]
["+ Einlagen",{"$f":"+BUCHFÜHRUNG!F155","v":650},null,"Familienbeihilfe"]
["- Entnahmen",{"$f":"+BUCHFÜHRUNG!D155+BUCHFÜHRUNG!D156","v":22520},null,"Ausgaben für den Haushalt plus private Stromausgaben"]
["= Cash Flow III",null,{"$f":"+C17+B18-B19","v":-12425}]
[]
["Der Cash-Flow stellt die Einnahmen und Ausgaben eines Unternehmens während eines Jahres gegenüber. Ausgehend von der Gewinn- und Verlustrechnung errechnet sich der Cash-Flow I, indem vom Gewinn die Abschreibungen und Minderwerte hinzugerechnet und die Mehrwerte abgezogen werden. Vom Cash-Flow I werden Ausgaben für Investitionen sowie Tilgungen für Kredite abgezogen, als Ergebnis wird der Cash-Flow II ausgewiesen. Der Cash-Flow III errechnet sich, indem vom Cash-Flow II die Einlagen hinzu- und die Entnahmen des Privatbereichs abgezogen werden. Der erhaltene Betrag wird auch als Free Cash-Flow ohne Fremdfinanzierung oder als Geldüberschuss bezeichnet."]
[]
[]
[]
["Analyse der Finanzierungskraft"]
[]
["Kapitalflussrechnung"]
[]
["Bezeichnung","Mittel-\nherkunft","Mittel-verwendung","Differenz"]
["Milchverkauf",{"$f":"+BUCHFÜHRUNG!F137","v":44125},null,null,"Nur Milchverkauf ohne Naturallierung an Haushalt"]
["Urlaub am Bauernhof",{"$f":"+BUCHFÜHRUNG!F143","v":25000},null,null,"Einnahmen Urlaub am Bauernhof"]
["Rinderverkauf",{"$f":"+BUCHFÜHRUNG!F148","v":7450},null,null,"Bestandesminderungen werden nicht berücksichtigt; sind keine Ausgaben, nur Aufwand"]
["Summe Einnahmen",{"$f":"SUM(B31:B33)","v":76575}]
["Dünger",{"$f":"-BUCHFÜHRUNG!D110","v":-4500},{"$f":"+BUCHFÜHRUNG!F111","v":4500},null,"Aufwand für Dünger"]
["Diverse Betriebsmittel",{"$f":"-BUCHFÜHRUNG!D115","v":-25000},{"$f":"+BUCHFÜHRUNG!F116","v":25000},null,"Aufwand für diverse Betriebsmittel"]
["Schuldzinsen",{"$f":"-BUCHFÜHRUNG!D120","v":-1100},{"$f":"+BUCHFÜHRUNG!F121","v":1100},null,"Aufwand für Schuldzinsen"]
["Strom",{"$f":"-BUCHFÜHRUNG!F126","v":-1480},{"$f":"+BUCHFÜHRUNG!F126","v":1480},null,"Nur betrieblicher Strom (Privatanteil ist abgezogen)"]
["Summe Ausgaben",null,{"$f":"SUM(C35:C38)","v":32080}]
["Umsatzbereich",null,null,{"$f":"+B34-C39","v":44495}]
["Desinvestitionen",0,null,null,"Keine Verkäufe von Anlagen"]
["Investitionen",null,{"$f":"+BUCHFÜHRUNG!D60","v":25000},null,"Kauf eines Ladewagens"]
["Anlagenbereich",null,null,{"$f":"+B41-C42","v":-25000}]
["Kreditaufnahme",0,null,null,"Keine Aufnahme neuer Kredit"]
["Kreditrückzahlung",null,{"$f":"+BUCHFÜHRUNG!D98","v":8500},null,"Tilgung"]
["Fremdkapitalbereich",null,null,{"$f":"+B44-C45","v":-8500}]
["Einlagen",{"$f":"+BUCHFÜHRUNG!F155","v":650},null,null,"Familienbeihilfe"]
["Entnahmen",null,{"$f":"+BUCHFÜHRUNG!D155+BUCHFÜHRUNG!D156","v":22520},null,"Ausgaben für den Haushalt plus private Stromausgaben"]
["Privatbereich",null,null,{"$f":"+B47-C48","v":-21870}]
["Erhalt Forderungen",{"$f":"+BUCHFÜHRUNG!D85","v":14800},null,null,"Offene Forderung wurde an uns gezahlt"]
["Zunahme Girokonto",null,{"$f":"+BUCHFÜHRUNG!F87-BUCHFÜHRUNG!D81","v":1075},null,"Endbestand minus Anfangsbestand"]
["Zunahme Kassa",null,{"$f":"+BUCHFÜHRUNG!F93-BUCHFÜHRUNG!D91","v":2850},null,"Endbestand minus Anfangsbestand"]
["Geldbereich",null,null,{"$f":"+B50-C51-C52","v":10875}]
[]
["Kontrollsumme",null,null,{"$f":"+D40+D43+D46+D49+D53","v":0},"Kontrollsumme muss 0 sein!"]
[]
["Die Kapitalflussrechnung stellt eine Bewegungsrechnung dar, die für einen bestimmten Zeitraum Herkunft und Verwendung verschiedener, liquiditätswirksamer Mittel gegenüberstellt. Die Beträge werden nach Mittelherkunft und Mittelverwendung getrennt."]
[]
[]
[]
[null,null,null,null,null,null,null,null,null,null,null,null,null,null,null,"ACHTUNG: MUSS NULL (0) SEIN!!!"]

{"sheet":"Hilfe.STAB","index":11,"n_rows":50,"n_cols":14,"rows_kept":50,"cut":false,"hidden":false,"merged":[[2,13,49,13],[2,2,2,9],[5,4,5,5],[12,3,13,3],[12,5,13,5],[12,6,13,6],[12,7,13,7],[46,2,46,9],[17,3,18,3],[17,5,18,5],[17,6,18,6],[17,7,18,7],[21,2,21,9],[31,2,31,9]]}
[null,null,"Analyse der Stabilität"]
[]
[null,null,"Stabilität wird definiert als die Fähigkeit eines Unternehmens, Rentabilität und Liquidität auch bei Eintritt unvorhergesehener Ereignisse langfristig zu sichern.",null,null,null,null,null,null,null,null,null,null,"ANLAGENVERZEICHNIS   -   RENTABILITTÄT   -   BUCHFÜHRUNG"]
[]
[null,null,"Fremdkapitalanteil"]
[null,null,"siehe Bilanzanalyse"]
[]
[null,null,"Anlagenintensität"]
[null,null,"siehe Bilanzanalyse"]
[]
[null,null,"Veralterungsgrad von abnutzbarem Anlagevermögen"]
[null,null,"Gebäude und bauliche Anlagen"]
[null,null,"Buchwert (31.12.)","=",{"$f":"+ANLAGENVERZEICHNISSE!J14","v":123100},"x 100","=",{"$f":"+E13/E14","v":0.49043824701195221}]
[null,null,"Summe Anschaffungswert",null,{"$f":"+ANLAGENVERZEICHNISSE!E13","v":251000}]
[]
[]
[null,null,"Maschinen und Geräte"]
[null,null,"Buchwert (31.12.)","=",{"$f":"+ANLAGENVERZEICHNISSE!J30","v":106700.33333333333},"x 100","=",{"$f":"+E18/E19","v":0.52794243284876907}]
[null,null,"Summe Anschaffungswert",null,{"$f":"+ANLAGENVERZEICHNISSE!E29","v":202106}]
[]
[]
[null,null,"Je niedriger der Veralterungsgrad, desto älter sind die Anlagengüter, das heißt, desto größer ist der Investitionsrückstand, sofern die Nutzungsdauer richtig eingeschätzt wurde. In einer ersten Näherung könnte die Aussage getroffen werden, dass bei einer Relation von Buchwert zu Anschaffungswert gleich 0,5 der Betrieb kontinuierlich investiert hat. Dies gilt aber streng genommen nur dann, wenn eine Inflationsrate von null Prozent vorläge. "]
[]
[null,null,"Eigenkapitalveränderung",null,null,null,null,null,null,null,null,null,"Analyse der Rentabilität"]
[null,null,"Einkünfte aus LuF",null,{"$f":"+BUCHFÜHRUNG!D31","v":25010.333333333336}]
[null,null,"+ Einlagen",null,{"$f":"+BUCHFÜHRUNG!F35","v":650},"Familienbeihilfe"]
[null,null,"= Gesamt(Haushalts)einkommen",null,{"$f":"+E25+E26","v":25660.333333333336}]
[null,null,"- Verbrauch",null,{"$f":"+BUCHFÜHRUNG!D35+BUCHFÜHRUNG!D36+BUCHFÜHRUNG!D37","v":22685},"Privatentnahmen *"]
[null,null,"= Eigenkapitalveränderung",null,{"$f":"+E27-E28","v":2975.3333333333358},"**"]
[]
[]
[null,null,"Die Höhe der Eigenkapitalveränderung informiert darüber, inwieweit der Gewinn und die Einlagen ausgereicht haben, die Entnahmen abzudecken. Eine positive Eigenkapitalveränderung ist deshalb erforderlich, da wegen der Inflation die zurückgelegten Abschreibungen für eine Ersatzinvestition nicht ausreichen. Die Eigenkapitalveränderung muss daher die Differenz aus Wiederbeschaffungswert und ursprünglichem Anschaffungswert abdecken. "]
[]
[]
[]
[null,null,null,null,null,null,null,null,null,null,null,"Formel anwenden"]
[null,null,"Kapitaldienstgrenze",null,null,null,null,null,null,null,null,"Werte stammen aus der Analyse der Stabilität (Eigenkapüitalveränderung), aus der Gewinn und Verlustrechnung"]
[null,null,"Bezeichnung",null,"Euro",null,null,null,null,null,null,"(gezahlte Schuldzinsen) und aus dem Anlagenverzeichnis (Afa für Gebäude und Maschinen)"]
[null,null,"Eigenkapitalveränderung",null,{"$f":"+E29","v":2975.3333333333358}]
[null,null,"+ gezahlte Schuldzinsen",null,{"$f":"+BUCHFÜHRUNG!D27","v":1100}]
[null,null,"= langfristige Kapitaldienstgrenze",null,{"$f":"+E39+E40","v":4075.3333333333358}]
[null,null,"+ AfA Gebäude",null,{"$f":"+BUCHFÜHRUNG!D130","v":11300}]
[null,null,"= mittelfristige Kapitaldienstgrenze",null,{"$f":"+E41+E42","v":15375.333333333336}]
[null,null,"+ AfA Maschinen",null,{"$f":"+BUCHFÜHRUNG!D131","v":6799.666666666667}]
[null,null,"= kurzfristige Kapitaldienstgrenze",null,{"$f":"+E43+E44","v":22175.000000000004}]
[]
[null,null,"Die langfristige Kapitaldienstgrenze drückt aus, wie viel maximal für Zinsen und Tilgung (=Kapitaldienst) bereits bestehender und zusätzlicher Kredite maximal zur Verfügung steht. Deshalb werden zur Eigenkapitalveränderung auch die gezahlten Schuldzinsen, die bereits im Aufwand enthalten waren, hinzugezählt. Bei der mittelfristigen Kapitaldienstgrenze werden auch die Abschreibungen für Gebäude und bauliche Anlagen, Bodenverbesserungen und Dauerkulturen dazugezählt. Bei der kurzfristigen Kapitaldienstgrenze sind noch die Abschreibungen für Maschinen und Geräte berücksichtigt. "]
[]
[null,null,"* Ausgaben Haushalt, Strom Privatanteil, Naturallieferung Milch"]
[null,null,"** Auch Überdeckung des Verbrauchs genannt"]